id,release_id,information_system,information_institution,information_storage_vendor,information_filesystem_type,information_client_nodes,information_client_total_procs,io500_score,io500_bw,io500_md,io500_tot_iops,information_data,information_10_node_challenge,information_list_name,information_identifier,information_submitter,information_submission_date,information_embargo_end_date,information_storage_install_date,information_storage_refresh_date,information_filesystem_name,information_filesystem_version,information_client_procs_per_node,information_client_operating_system,information_client_operating_system_version,information_client_kernel_version,information_md_nodes,information_md_storage_devices,information_md_storage_type,information_md_volatile_memory_capacity,information_md_storage_interface,information_md_network,information_md_software_version,information_md_operating_system_version,information_ds_nodes,information_ds_storage_devices,information_ds_storage_type,information_ds_volatile_memory_capacity,information_ds_storage_interface,information_ds_network,information_ds_software_version,information_ds_operating_system_version,information_note,information_best,ior_easy_write,ior_easy_read,ior_hard_write,ior_hard_read,mdtest_easy_write,mdtest_easy_stat,mdtest_easy_delete,mdtest_hard_write,mdtest_hard_read,mdtest_hard_stat,mdtest_hard_delete,find_easy,find_hard,find_mixed,marker_score,marker_md,storage_data,include_in_io500,valid_from,valid_to,cdcl_url,repository_url,user_id,result_tar,result_tar_dir,result_tar_size,result_tar_type,job_script,job_script_dir,job_script_size,job_script_type,job_output,job_output_dir,job_output_size,job_output_type,system_information,system_information_dir,system_information_size,system_information_type,information_client_sockets,information_ds_clock,information_ds_media_secondary_count,information_ds_media_primary_vendor,information_ds_model,information_ds_media_secondary_capacity,information_md_spdk,information_md_media_secondary_vendor,information_ds_kernel_version,status_old,information_client_interconnect_vendor,information_ds_interconnect_rdma,information_ds_media_secondary_vendor,status_id,information_client_dpdk,information_md_interconnect_links,information_md_dpdk,information_ds_architecture,information_md_interconnect_vendor,information_ds_interconnect_links,information_client_interconnect_type,information_ds_cores_per_socket,information_md_media_primary_count,information_md_media_secondary_count,information_client_spdk,information_md_media_secondary_capacity,information_md_kernel_version,information_ds_interconnect_type,information_ds_interconnect_vendor,information_md_architecture,information_ds_sockets,information_md_interconnect_rdma,information_client_model,information_md_media_secondary_interface,information_client_interconnect_links,information_ds_operating_system,information_ds_spdk,information_client_cores_per_socket,information_md_interconnect_bandwidth,information_client_volatile_memory_capacity,information_client_clock,information_ds_media_secondary_interface,information_md_clock,information_ds_media_primary_count,information_client_architecture,information_client_interconnect_rdma,information_md_media_primary_type,information_md_model,information_ds_interconnect_bandwidth,information_md_operating_system,information_ds_dpdk,information_client_interconnect_bandwidth,information_ds_media_primary_interface,information_md_cores_per_socket,information_ds_media_primary_capacity,information_md_media_secondary_type,information_ds_media_secondary_type,information_md_media_primary_vendor,information_md_media_primary_interface,information_md_media_primary_capacity,information_md_interconnect_type,information_ds_media_primary_type,information_md_sockets,score
1,ISC20,"Officinalis (1 Client)",,"Red Hat, Intel, QCT",CephFS,1,112,27.430000,8.810000,85.480000,67.490000,zip,,isc20,2020-07-38,"Red Hat",7/13/20,,2019-09-01,,,"Master (02fc51de)",112,CentOS,"CentOS Linux release 8.0.1905 (Core)",4.18.0-147.6.el8.x86_64,8,8,NVMe,384GB,NVMe,4x25GbE,,"CentOS Linux release 8.0.1905 (Core)",8,8,NVMe,384GB,NVMe,4x25GbE,,"CentOS Linux release 8.0.1905 (Core)",,,10.250000,10.230000,7.630000,7.510000,123.680000,359.290000,100.240000,16.190000,92.430000,101.850000,16.420000,256.000000,,256.000000,,,2020.07.13-17.30.55-scr.zip,1,7/13/20,,,,,,,0,,,,0,,,,0,,,,0,,0,,,,,,,,,,,,,,,,,,,,,,,,,,,,,,,,,,0,,,0,,,,,,,,,,,,,,,,,,,,,,,,,,27.43
2,SC19,"IST Austria HPC","IST Austria",Homemade@IST,BeeGFS,4,80,8.410000,1.770000,39.980000,23.820000,zip,,sc19,2019-11-19,"Janos Kiss",11/8/19,,2019-09-02,,BeeGFS,7.1.3,20,Debian,"Debian 9 (stretch)",4.9.0-9-amd64,2,2,"NVMe Samsung PM1725A 6.4TB",128GB,NVMe,IB-EDR,"EXT4, BeeGFS 7.1.3","Debian 9 (stretch)",3,132,"HDD HGST_HUH721010ALE600 10TB 7200RPM",128GB,"PCI-e 3.0 x8 LSI9300-8e HBA 12Gbps SAS-SATA",IB-EDR,"ZFS 0.8.2, BeeGFS 7.1.3","Debian 9 (stretch)",,,5.530000,7.810000,0.140000,1.630000,31.980000,161.530000,38.750000,8.200000,16.440000,91.110000,8.860000,300.000000,,300.000000,,,2019-11-08-ISTAustriaBeeGFSBeeGFS-4-20.zip,1,11/8/19,,,https://github.com/IO500/submission-data/tree/master/IST%20Austria/IST%20Austria%20HPC/BeeGFS/2019/submission-172,,,,0,,,,0,,,,0,,,,0,,0,,,,,,,,,,,,,,,,,,,,,,,,,,,,,,,,,,0,,,0,,,,,,,,,,,,,,,,,,,,,,,,,,8.41
3,ISC20,Officinalis,,"Red Hat, Intel, QCT",CephFS,8,256,66.880000,28.580000,156.480000,149.560000,zip,,isc20,2020-07-6,"Red Hat",7/13/20,,2019-09-01,,,"Master (02fc51de)",32,CentOS,"CentOS Linux release 8.0.1905 (Core)",4.18.0-147.6.el8.x86_64,8,8,NVMe,384GB,NVMe,4x25GbE,,"CentOS Linux release 8.0.1905 (Core)",8,8,NVMe,384GB,NVMe,4x25GbE,,"CentOS Linux release 8.0.1905 (Core)",,,57.470000,70.800000,11.610000,14.130000,174.640000,719.130000,131.730000,10.400000,132.620000,417.700000,28.700000,1314.000000,,1314.000000,,,2020.07.08-13.32.59-app.zip,1,7/13/20,,,,,,,0,,,,0,,,,0,,,,0,,0,,,,,,,,,,,,,,,,,,,,,,,,,,,,,,,,,,0,,,0,,,,,,,,,,,,,,,,,,,,,,,,,,66.88
4,ISC20,"NCSA Industry System","National Center for Supercomputing Applications",DDN/Dell,"Spectrum Scale",8,96,12.370000,3.030000,50.540000,33.310000,zip,,isc20,2020-07-4,"National Center for Supercomputing Applications",7/13/20,,03/2015,10/2019,scratch,5.0.5.0,12,RHEL,7.8,3.10.0-1127.10.1.el7.x86_64,4,4,NVMe,128,Infiniband,Infiniband,5.0.5.0,7.8,4,84,HDD,128,Infiniband,Infiniband,5.0.5.0,7.8,,,9.380000,10.080000,0.770000,1.150000,81.880000,222.300000,58.880000,8.360000,21.410000,23.260000,8.440000,1131.000000,,1131.000000,,,2020.07.02-12.32.35-app.zip,1,7/13/20,,,https://github.com/IO500/submission-data/tree/master/National%20Center%20for%20Supercomputing%20Applications/NCSA%20Industry%20System/scratch/2020/submission-153,,,,0,,,,0,,,,0,,,,0,,0,,,,,,,,,,,,,,,,,,,,,,,,,,,,,,,,,,0,,,0,,,,,,,,,,,,,,,,,,,,,,,,,,12.37
5,SC19,"DGX-2H SuperPOD",NVIDIA,DDN,Lustre,10,400,249.500000,86.970000,715.760000,597.160000,zip,1,sc19,2019-11-1,NVIDIA,11/12/19,111919,11/05,110519,Exascaler,5,40,"NVIDIA DGX-OS",4.02,4.15.0-50-generic,10,2,NVMe,1.92TB,"Mellanox EDR InfiniBand","Mellanox EDR InfiniBand",Exascaler,Exa5.0,10,21,NVMe,1.92TB,"Mellanox EDR InfiniBand","Mellanox EDR InfiniBand",Exascaler,Exa5.0,,,273.160000,286.170000,11.160000,65.590000,799.580000,2000.810000,485.870000,446.270000,472.520000,881.030000,584.580000,816.000000,,816.000000,,,2019-11-12-NVIDIAExascalerLustre-10-40.zip,1,11/12/19,,,https://github.com/IO500/submission-data/tree/master/NVIDIA/DGX-2H%20SuperPOD/Exascaler/2019/submission-22,,,,0,,,,0,,,,0,,,,0,,0,,,,,,,,,,,,,,,,,,,,,,,,,,,,,,,,,,0,,,0,,,,,,,,,,,,,,,,,,,,,,,,,,249.5
6,ISC20,NextGENIO,EPCC,"NextGenIO (BSC & JGU)",GekkoFS,10,280,152.300000,24.830000,934.120000,469.590000,zip,1,isc20,2020-07-8,"Ramon Nou",7/13/20,,2019-01-01,2020-06-29,GekkoFS,0.8dev,28,CentOS,,3.10.0-862.14.4.el7.x86_64,28,2,3DXPNVMeSSDv,2,NVMe,Omnipath,0.8dev,,28,2,3DXPNVMeSSD,2,NVMe,Omnipath,0.8dev,,,,64.150000,71.440000,3.450000,24.060000,1880.280000,1841.930000,981.050000,187.320000,547.290000,1773.110000,299.220000,3137.000000,,3137.000000,,,2020.07.14-08.49.39-scr.zip,1,7/13/20,,,https://github.com/IO500/submission-data/tree/master/EPCC/NextGENIO/GekkoFS/2020/submission-31,,,,0,,,,0,,,,0,,,,0,,0,,,,,,,,,,,,,,,,,,,,,,,,,,,,,,,,,,0,,,0,,,,,,,,,,,,,,,,,,,,,,,,,,152.3
7,ISC20,bracewell,CSIRO,Dell/DDN,Lustre,10,400,99.640000,39.900000,248.810000,227.700000,zip,1,isc20,2020-07-14,CSIRO,7/13/20,,2018-08-08,,scratch2,2.12.3,40,CentOS,7.7,3.10,8,4,NVMe,192,NVMe,IB-EDR,2.12.3,7.7,8,20,NVMe,192,NVMe,IB-EDR,2.12.3,7.7,,,135.030000,133.620000,10.440000,13.460000,206.330000,485.450000,186.400000,150.710000,208.810000,378.140000,124.150000,532.000000,,532.000000,,,2020.07.14-13.32.08-scr.zip,1,7/13/20,,https://www.vi4io.org/hpsl/2020/aus/CSIRO/start,https://github.com/IO500/submission-data/tree/master/CSIRO/bracewell/scratch2/2020/submission-47,,,,0,,,,0,,,,0,,,,0,,0,,,,,,,,,,,,,,,,,,,,,,,,,,,,,,,,,,0,,,0,,,,,,,,,,,,,,,,,,,,,,,,,,99.64
8,ISC20,"MOGON II","Johannes Gutenberg University Mainz","JGU (ADA-FS)& BSC (NEXTGenIO)",GekkoFS,10,160,96.460000,11.610000,801.600000,329.100000,zip,1,isc20,2020-07-19,"Marc-AndrÃ© Vef",7/13/20,,2017-10-01,,GekkoFS,0.8dev,16,CentOS,,3.10.0-1127.8.2.el7.x86_64,200,1,"Intel SSD DC S4600 Series",,SATA,Omnipath,0.8dev,,200,1,"Intel SSD DC S4600 Series",,SATA,Omnipath,0.8dev,,,,63.110000,22.490000,2.870000,4.460000,1462.020000,1454.740000,782.980000,249.100000,284.090000,1493.590000,273.360000,3543.000000,,3543.000000,,,2020.07.13-23.48.39-scr.zip,1,7/13/20,,,https://github.com/IO500/submission-data/tree/master/Johannes%20Gutenberg%20University%20Mainz/MOGON%20II/GekkoFS/2020/submission-50,,,,0,,,,0,,,,0,,,,0,,0,,,,,,,,,,,,,,,,,,,,,,,,,,,,,,,,,,0,,,0,,,,,,,,,,,,,,,,,,,,,,,,,,96.46
9,SC19,TStor3000,"State Key Laboratory of High-end Server & Storage Technology (HSS)",INSPUR,BeeGFS,10,300,82.570000,41.140000,165.710000,175.430000,zip,1,sc19,2019-11-14,,11/7/19,,2019-10-10,2019-11-01,beegfs,7.1.3,30,Linux,CentOS7.6,3.10.0-957.el7.x86_64,24,3,AEP,384GB,AEP,EDR,7.1.3,CentOS7.6,24,192,NVME,384GB,NVME,EDR,7.1.3,CentOS7.6,,,105.100000,97.260000,6.430000,43.560000,478.030000,2621.060000,762.010000,8.470000,26.920000,121.680000,11.870000,1810.000000,,1810.000000,,,2019-11-07-StateKeyLaboratoryofHigh-endServerStorageTechnologyHSSbeegfsBeeGFS-10-30.zip,1,11/7/19,,,https://github.com/IO500/submission-data/tree/master/State%20Key%20Laboratory%20of%20High-end%20Server%20%26%20Storage%20Technology%20%28HSS%29/TStor3000/beegfs/2019/submission-58,,,,0,,,,0,,,,0,,,,0,,0,,,,,,,,,,,,,,,,,,,,,,,,,,,,,,,,,,0,,,0,,,,,,,,,,,,,,,,,,,,,,,,,,82.57
10,SC19,AI400,DDN,DDN,Lustre,10,240,63.880000,19.650000,207.630000,159.380000,zip,1,sc19,2019-11-7,"Shuichi Ihara",11/10/19,,,,AI400,2.12.58,24,CentOS,8.0,4.18.0-80.el8.x86_64,2,0,SSD,64GB,NVMe,Infiniband,2.12.58,CentOS7.6,2,12,SSD,64GB,NVMe,Infiniband,2.12.58,CentOS7.6,,,28.620000,41.720000,2.960000,42.190000,152.840000,451.970000,132.760000,79.650000,172.590000,449.930000,75.150000,810.000000,,810.000000,,,2019-11-10-DDNAI400Lustre-10-24.zip,1,11/10/19,,,https://github.com/IO500/submission-data/tree/master/DDN/AI400/AI400/2019/submission-75,,,,0,,,,0,,,,0,,,,0,,0,,,,,,,,,,,,,,,,,,,,,,,,,,,,,,,,,,0,,,0,,,,,,,,,,,,,,,,,,,,,,,,,,63.88
11,ISC20,EC2-10xi3en.metal,"Red Hat","Red Hat",CephFS,10,320,57.170000,26.290000,124.300000,124.750000,zip,1,isc20,2020-07-41,"Red Hat",7/13/20,,2020-07-05,,,"Master (e9cc7d86)",32,Fedora,31,5.7.6-201.fc32.x86_64,10,8,NVMe,768GB,NVMe,100GbE,,"Fedora 31",10,8,NVMe,768GB,,,,"Fedora 31",,,36.260000,75.620000,9.140000,19.080000,191.980000,903.110000,123.450000,17.190000,87.510000,97.400000,18.810000,966.000000,,966.000000,,,2020.07.07-20.27.19-scr.zip,1,7/13/20,,,,,,,0,,,,0,,,,0,,,,0,,0,,,,,,,,,,,,,,,,,,,,,,,,,,,,,,,,,,0,,,0,,,,,,,,,,,,,,,,,,,,,,,,,,57.17
12,SC19,Penguin-ASG-NVBeeOne,"Penguin Computing Benchmarking and Innovation Lab","Penguin Computing/Excelero",BeeGFS,10,320,39.650000,17.710000,88.760000,87.370000,zip,1,sc19,2019-11-18,"Kevin Tubbs",11/12/19,2019-11-11,2019-08-12,2019-08-12,BeeGFS-NVMesh,7.1.3,32,RHEL,7.6,3.10.0-957.27.2.el7.x86_64,8,4,NVMe,,EDR,EDR,7.1.3,"RHEL 7.6",8,72,NVMe,,NVMe,EDR,7.1.3,"RHEL 7.6",,,30.960000,57.520000,1.760000,31.460000,156.840000,1681.390000,120.220000,7.850000,25.480000,107.330000,7.330000,772.000000,,772.000000,,,2019-11-12-PenguinComputingBenchmarkingandInnovationLabBeeGFS-NVMeshBeeGFS-10-32.zip,1,11/12/19,,,https://github.com/IO500/submission-data/tree/master/Penguin%20Computing%20Benchmarking%20and%20Innovation%20Lab/Penguin-ASG-NVBeeOne/BeeGFS-NVMesh/2019/submission-98,,,,0,,,,0,,,,0,,,,0,,0,,,,,,,,,,,,,,,,,,,,,,,,,,,,,,,,,,0,,,0,,,,,,,,,,,,,,,,,,,,,,,,,,39.65
13,ISC20,SharedScratch,"Janelia Research Campus, HHMI",WekaIO,"Parallel Filesystem",10,600,31.390000,12.340000,79.830000,72.170000,zip,1,isc20,2020-07-24,"Janelia Scientific Computing Systems",7/13/20,,2/2019,,wekafs,3.7.0,60,Scientific-Linux,7.7,3.10.0-1062.9.1.el7.x86_64,0,0,,,,,,,20,80,Flash,192GB,NVMe,100GbE,3.7.0,7.7,,,11.710000,22.590000,9.000000,9.740000,33.730000,1088.990000,32.470000,14.510000,91.440000,147.390000,17.360000,408.000000,,408.000000,,,2020.06.02-08.56.31-app.zip,1,7/13/20,,,https://github.com/IO500/submission-data/tree/master/Janelia%20Research%20Campus%2C%20HHMI/SharedScratch/wekafs/2020/submission-111,,,,0,,,,0,,,,0,,,,0,,0,,,,,,,,,,,,,,,,,,,,,,,,,,,,,,,,,,0,,,0,,,,,,,,,,,,,,,,,,,,,,,,,,31.39
14,SC19,"Palmetto Burstbuffer","Clemson University",AdvancedHPC,BeeGFS,10,120,21.550000,12.970000,35.800000,42.990000,zip,1,sc19,2019-11-34,"Clemson University ACI",11/1/19,,2019-05-01,,burstbuffer,7.1.3,12,"Oracle Linux",7.6,4.1.12-103.9.4.el7uek.x86_64,4,2,NVMe,512GB,NVMe,EDR,7.1.3,7.7,4,24,NVMe,512GB,NVMe,EDR,7.1.3,7.7,,,20.870000,29.590000,3.510000,13.060000,34.390000,190.590000,48.810000,3.910000,15.520000,55.580000,2.610000,957.000000,,957.000000,,,2019-11-01-ClemsonUniversityburstbufferBeeGFS-10-12.zip,1,11/1/19,,,https://github.com/IO500/submission-data/tree/master/Clemson%20University/Palmetto%20Burstbuffer/burstbuffer/2019/submission-124,,,,0,,,,0,,,,0,,,,0,,0,,,,,,,,,,,,,,,,,,,,,,,,,,,,,,,,,,0,,,0,,,,,,,,,,,,,,,,,,,,,,,,,,21.55
15,ISC20,HAL,"National Center for Supercomputing Applications",DDN,"Spectrum Scale",10,100,11.310000,3.620000,35.370000,27.860000,zip,1,isc20,2020-07-26,"National Center for Supercomputing Applications",7/13/20,,09/2019,,HAL,5.0.5.0,10,CentOS,7.7,4.18.0-147.0.3.el7.ppc64le,8,2,NVMe,32,Infiniband,Infiniband,5.0.5.0,7.6,8,2,NVMe,32,Infiniband,Infiniband,5.0.5.0,7.6,,,14.860000,12.740000,0.430000,2.100000,71.460000,105.830000,33.260000,2.390000,65.370000,104.910000,0.460000,1300.000000,,1300.000000,,,2020.06.27-06.53.38-scr.zip,1,7/13/20,,,https://github.com/IO500/submission-data/tree/master/National%20Center%20for%20Supercomputing%20Applications/HAL/HAL/2020/submission-157,,,,0,,,,0,,,,0,,,,0,,0,,,,,,,,,,,,,,,,,,,,,,,,,,,,,,,,,,0,,,0,,,,,,,,,,,,,,,,,,,,,,,,,,11.31
16,SC19,Sherlock/Regal,Stanford,Dell,Lustre,10,160,7.050000,1.640000,30.280000,19.300000,zip,1,sc19,2019-11-29,"Stanford Research Computing Center",11/8/19,,2013-05-28,2016-08-05,Sherlock/Regal,2.8.0,16,CentOS,7.6,3.10.0-957.27.2.el7.x86_64,1,1,HDD,128GB,SAS,Infiniband,2.8.0,6.7,18,108,NL-SAS7.2K,128GB,SAS,Infiniband,2.8.0,6.7,,,3.660000,6.680000,0.420000,0.710000,13.110000,129.690000,12.340000,11.730000,19.320000,41.740000,7.740000,460.000000,,460.000000,,,2019-11-08-StanfordSherlockRegalLustre-10-16.zip,1,11/8/19,,,https://github.com/IO500/submission-data/tree/master/Stanford/Sherlock/Regal/Sherlock/Regal/2019/submission-184,,,,0,,,,0,,,,0,,,,0,,0,,,,,,,,,,,,,,,,,,,,,,,,,,,,,,,,,,0,,,0,,,,,,,,,,,,,,,,,,,,,,,,,,7.05
17,SC19,dm11,"Janelia Research Campus, HHMI",#N/A,"Scale-out NAS",10,760,6.420000,2.610000,15.820000,14.610000,zip,1,sc19,2019-11-43,"Janelia Scientific Computing Systems",11/10/19,,32018,,#N/A,8.1.2,76,Scientific-Linux,7.6,3.10.0-957.10.1.el7.x86_64,12,180,NAND,256GB,SAS,40GbE,8.1.2,7.6,56,840,HDD,128GB,SATA,40GbE,8.1.2,7.6,,,16.130000,13.390000,0.040000,5.950000,102.150000,290.650000,12.640000,0.990000,18.050000,13.610000,0.350000,123.000000,,123.000000,,,2019-11-10-JaneliaResearchCampusHowardHughesMedicalInstituteScale-outNAS-10-76.zip,1,11/10/19,,,https://github.com/IO500/submission-data/tree/master/Janelia%20Research%20Campus%2C%20HHMI/dm11/%23N/A/2019/submission-188,,,,0,,,,0,,,,0,,,,0,,0,,,,,,,,,,,,,,,,,,,,,,,,,,,,,,,,,,0,,,0,,,,,,,,,,,,,,,,,,,,,,,,,,6.42
18,SC19,nrs,"Janelia Research Campus, HHMI",Qumulo,"Scale-out NAS",10,760,4.190000,2.880000,6.110000,8.010000,zip,1,sc19,2019-11-36,"Janelia Scientific Computing Systems",11/10/19,,92016,,"Qumulo FS",2.14.0.1,76,Scientific-Linux,7.6,3.10.0-957.10.1.el7.x86_64,0,13,SSD,,SATA,,,,20,520,HDD,128GB,SATA,40GbE,2.14.0.1,7.6,,,5.440000,13.370000,0.170000,5.710000,9.030000,171.200000,10.770000,0.210000,9.810000,9.070000,0.180000,35.000000,,35.000000,,,2019-11-10-JaneliaResearchCampusHowardHughesMedicalInstituteQumuloFSScale-outNAS-10-76.zip,1,11/10/19,,,https://github.com/IO500/submission-data/tree/master/Janelia%20Research%20Campus%2C%20HHMI/nrs/Qumulo%20FS/2019/submission-206,,,,0,,,,0,,,,0,,,,0,,0,,,,,,,,,,,,,,,,,,,,,,,,,,,,,,,,,,0,,,0,,,,,,,,,,,,,,,,,,,,,,,,,,4.19
19,SC19,nearline4,"Janelia Research Campus, HHMI",Qumulo,"Scale-out NAS",10,760,3.670000,2.450000,5.490000,7.070000,zip,1,sc19,2019-11-24,"Janelia Scientific Computing Systems",11/10/19,,112018,,"Qumulo FS",2.14.0.1,76,Scientific-Linux,7.6,3.10.0-957.10.1.el7.x86_64,0,3,SSD,,SATA,,,,40,480,HDD,64GB,SATA,10GbE,2.14.0.1,7.6,,,6.710000,8.320000,0.130000,4.990000,8.170000,147.780000,5.640000,0.180000,11.880000,10.280000,0.180000,31.000000,,31.000000,,,2019-11-10-JaneliaResearchCampusHowardHughesMedicalInstituteQumuloFSScale-outNAS-10-76.zip,1,11/10/19,,,https://github.com/IO500/submission-data/tree/master/Janelia%20Research%20Campus%2C%20HHMI/nearline4/Qumulo%20FS/2019/submission-208,,,,0,,,,0,,,,0,,,,0,,0,,,,,,,,,,,,,,,,,,,,,,,,,,,,,,,,,,0,,,0,,,,,,,,,,,,,,,,,,,,,,,,,,3.67
20,SC19,TigerShark,SUSE,"SUSE, Intel, Lenovo","SUSE Enterprise Storage - CephFS",15,120,14.910000,5.740000,38.720000,34.510000,zip,,sc19,2019-11-40,"David Byte",11/7/19,,2018-11-01,2019-10-01,,"6 (14.2.4)",8,"SUSE Linux Enterprise","15 SP1",4.12.14-197.21-default,15,1,NVME,32GB,NVMe,"100Gb Ethernet","6 (14.2.4)","15 SP1",10,119,SSD,96GB,SATA,"100Gb Ethernet","6 (14.2.4)","15 SP1",,,16.070000,9.140000,1.570000,4.700000,32.820000,127.920000,20.840000,12.920000,41.640000,68.790000,6.220000,251.000000,,251.000000,,,2019-11-07-SUSESUSEEnterpriseStorage-CephFS-15-8.zip,1,11/7/19,,,,,,,0,,,,0,,,,0,,,,0,,0,,,,,,,,,,,,,,,,,,,,,,,,,,,,,,,,,,0,,,0,,,,,,,,,,,,,,,,,,,,,,,,,,14.91
21,ISC20,Presque,"Argonne National Laboratory","Argonne National Laboratory",DAOS,16,544,537.310000,108.190000,2668.570000,1544.190000,zip,,isc20,2020-07-10,"Argonne National Laboratory",7/13/20,,2019-11-15,2019-11-15,DAOS,1.1,34,RHEL,7.7,3.10.0-1062.4.3.el7.x86_64,10,12,"Intel Apache Pass 128GB DIMM",384,DIMM,100gE,1.1,7.7,10,12,NVMe-SSD,384,NVMe,100gE,1.1,7.7,,,114.580000,130.230000,112.270000,81.770000,4386.200000,4521.230000,2559.270000,924.090000,2100.110000,3730.500000,2357.160000,2969.000000,,2969.000000,,,2020.07.09-19.56.01-scr.zip,1,7/13/20,,,https://github.com/IO500/submission-data/tree/master/Argonne%20National%20Laboratory/Presque/DAOS/2020/submission-10,,,,0,,,,0,,,,0,,,,0,,0,,,,,,,,,,,,,,,,,,,,,,,,,,,,,,,,,,0,,,0,,,,,,,,,,,,,,,,,,,,,,,,,,537.31
22,SC19,SharedScratch,"Janelia Research Campus, HHMI",WekaIO,wekaio,18,1368,48.750000,26.220000,90.620000,100.970000,zip,,sc19,2019-11-30,"Janelia Scientific Computing Systems",11/9/19,,22019,,wekafs,3.5.2,76,Scientific-Linux,7.7,3.10.0-957.10.1.el7.x86_64,0,0,,,,,,,20,80,Flash,96GB,NVMe,100GbE,3.5.2,7.7,,,28.560000,32.550000,12.930000,39.350000,34.440000,3067.650000,34.050000,10.780000,195.560000,77.340000,10.120000,767.000000,,767.000000,,,2019-11-09-JaneliaResearchCampusHowardHughesMedicalInstitutewekafswekaio-18-76.zip,1,11/9/19,,,https://github.com/IO500/submission-data/tree/master/Janelia%20Research%20Campus%2C%20HHMI/SharedScratch/wekafs/2019/submission-89,,,,0,,,,0,,,,0,,,,0,,0,,,,,,,,,,,,,,,,,,,,,,,,,,,,,,,,,,0,,,0,,,,,,,,,,,,,,,,,,,,,,,,,,48.75
23,SC19,"bracewell scratch2",CSIRO,Dell/ThinkParQ,beegfs,26,260,94.860000,69.100000,130.230000,177.590000,zip,,sc19,2019-11-4,"CSIRO IM&T",11/12/19,,,,scratch2,7.1.3,10,SUSE,"SLES 12 SP4",4.12,2,24,NVMe,384GB,NVMe,"IB EDR",7.1.3,"SLES 12 SP4",12,24,NVMe,192GB,NVMe,"IB EDR",7.1.3,"SLES 12 SP4",,,228.980000,180.440000,5.430000,101.640000,143.570000,882.770000,231.880000,10.950000,36.150000,139.090000,17.560000,2911.000000,,2911.000000,,,2019-11-12-CSIROscratch2beegfs-26-10.zip,1,11/12/19,,,https://github.com/IO500/submission-data/tree/master/CSIRO/bracewell%20scratch2/scratch2/2019/submission-52,,,,0,,,,0,,,,0,,,,0,,0,,,,,,,,,,,,,,,,,,,,,,,,,,,,,,,,,,0,,,0,,,,,,,,,,,,,,,,,,,,,,,,,,94.86
24,SC19,"Oracle Cloud Infrastructure with Block Volume Service running Spectrum Scale ","Oracle Cloud Infrastructure","Oracle Cloud Infrastructure Block Volumes Service","Spectrum Scale",30,480,47.550000,20.380000,110.930000,106.230000,zip,,sc19,2019-11-42,"Pinkesh Valdria",10/3/19,,,,"Spectrum Scale",5.0.3.2,16,"CentOS Linux","CentOS Linux release 7.6.1810 (Core)  ",3.10.0-957.27.2.el7.x86_64,22,11,"NVMe SSD","768 GB"," iSCSI  (network attached)","25Gbps Ethernet","IBM Spectrum Scale 5.0.3.2","CentOS Linux release 7.6.1810 (Core) with Kernel (3.10.0-957.27.2.el7.x86_64)",22,11,"NVMe SSD","768 GB"," iSCSI  (network attached)","25Gbps Ethernet","IBM Spectrum Scale 5.0.3.2","CentOS Linux release 7.6.1810 (Core) with Kernel (3.10.0-957.27.2.el7.x86_64)",,,36.380000,53.590000,3.610000,24.550000,430.840000,604.520000,341.630000,17.930000,31.540000,30.860000,8.720000,1692.000000,,1692.000000,,,2019-10-03-OracleCloudInfrastructureSpectrumScaleSpectrumScale-30-16.zip,1,10/3/19,,,https://github.com/IO500/submission-data/tree/master/Oracle%20Cloud%20Infrastructure/Oracle%20Cloud%20Infrastructure%20with%20Block%20Volume%20Service%20running%20Spectrum%20Scale%20/Spectrum%20Scale/2019/submission-90,,,,0,,,,0,,,,0,,,,0,,0,,,,,,,,,,,,,,,,,,,,,,,,,,,,,,,,,,0,,,0,,,,,,,,,,,,,,,,,,,,,,,,,,47.55
25,ISC20,AI400X,DDN,DDN,Lustre,40,1280,137.030000,46.840000,400.840000,330.100000,zip,,isc20,2020-07-33,"Shuichi Ihara",7/13/20,,2020-06-30,2020-06-30,Exascaler,2.13.54,32,CentOS,8.1,4.18.0-147.8.1.el8_1.x86_64,0,0,0,0,0,0,0,0,4,10,NVMe,3.84TB,NVMe,IB-EDR,2.13.54,CentOS7.7,,,73.570000,88.890000,10.190000,72.230000,378.840000,1069.150000,237.280000,131.450000,350.850000,1108.620000,99.590000,1362.000000,,1362.000000,,,2020.07.14-14.55.35-scr.zip,1,7/13/20,,,https://github.com/IO500/submission-data/tree/master/DDN/AI400X/Exascaler/2020/submission-37,,,,0,,,,0,,,,0,,,,0,,0,,,,,,,,,,,,,,,,,,,,,,,,,,,,,,,,,,0,,,0,,,,,,,,,,,,,,,,,,,,,,,,,,137.03
26,ISC20,"SpectrumScale on Oracle Cloud","Oracle Cloud Infrastructure","Oracle Cloud Infrastructure","Spectrum Scale",48,768,70.910000,34.910000,144.060000,151.280000,zip,,isc20,2020-07-25,"PINKESH VALDRIA",7/13/20,,2020-06-07,2020-06-07,OCI-SpectrumScale,5.0.5.0,16,CentOS,7.8,3.10.0-1127.10.1.el7.x86_64,40,10,NVMe,"768 GB",iSCSI,Ethernet,5.0.5.0,CentOS78,40,10,NVMe,"768 GB",iSCSI,Ethernet,5.0.5.0,CentOS78,,,83.340000,93.460000,4.730000,40.290000,986.280000,796.960000,408.900000,18.900000,28.140000,48.680000,10.080000,2212.000000,,2212.000000,,,2020.07.09-15.51.08-app.zip,1,7/13/20,,,https://github.com/IO500/submission-data/tree/master/Oracle%20Cloud%20Infrastructure/SpectrumScale%20on%20Oracle%20Cloud/OCI-SpectrumScale/2020/submission-64,,,,0,,,,0,,,,0,,,,0,,0,,,,,,,,,,,,,,,,,,,,,,,,,,,,,,,,,,0,,,0,,,,,,,,,,,,,,,,,,,,,,,,,,70.91