id,release_id,information_system,information_institution,information_storage_vendor,information_filesystem_type,information_client_nodes,information_client_total_procs,io500_score,io500_bw,io500_md,io500_tot_iops,information_data,information_10_node_challenge,information_list_name,information_identifier,information_submitter,information_submission_date,information_embargo_end_date,information_storage_install_date,information_storage_refresh_date,information_filesystem_name,information_filesystem_version,information_client_procs_per_node,information_client_operating_system,information_client_operating_system_version,information_client_kernel_version,information_md_nodes,information_md_storage_devices,information_md_storage_type,information_md_volatile_memory_capacity,information_md_storage_interface,information_md_network,information_md_software_version,information_md_operating_system_version,information_ds_nodes,information_ds_storage_devices,information_ds_storage_type,information_ds_volatile_memory_capacity,information_ds_storage_interface,information_ds_network,information_ds_software_version,information_ds_operating_system_version,information_note,information_best,ior_easy_write,ior_easy_read,ior_hard_write,ior_hard_read,mdtest_easy_write,mdtest_easy_stat,mdtest_easy_delete,mdtest_hard_write,mdtest_hard_read,mdtest_hard_stat,mdtest_hard_delete,find_easy,find_hard,find_mixed,marker_score,marker_md,storage_data,include_in_io500,valid_from,valid_to,cdcl_url,repository_url,user_id,result_tar,result_tar_dir,result_tar_size,result_tar_type,job_script,job_script_dir,job_script_size,job_script_type,job_output,job_output_dir,job_output_size,job_output_type,system_information,system_information_dir,system_information_size,system_information_type,information_client_sockets,information_ds_clock,information_ds_media_secondary_count,information_ds_media_primary_vendor,information_ds_model,information_ds_media_secondary_capacity,information_md_spdk,information_md_media_secondary_vendor,information_ds_kernel_version,status_old,information_client_interconnect_vendor,information_ds_interconnect_rdma,information_ds_media_secondary_vendor,status_id,information_client_dpdk,information_md_interconnect_links,information_md_dpdk,information_ds_architecture,information_md_interconnect_vendor,information_ds_interconnect_links,information_client_interconnect_type,information_ds_cores_per_socket,information_md_media_primary_count,information_md_media_secondary_count,information_client_spdk,information_md_media_secondary_capacity,information_md_kernel_version,information_ds_interconnect_type,information_ds_interconnect_vendor,information_md_architecture,information_ds_sockets,information_md_interconnect_rdma,information_client_model,information_md_media_secondary_interface,information_client_interconnect_links,information_ds_operating_system,information_ds_spdk,information_client_cores_per_socket,information_md_interconnect_bandwidth,information_client_volatile_memory_capacity,information_client_clock,information_ds_media_secondary_interface,information_md_clock,information_ds_media_primary_count,information_client_architecture,information_client_interconnect_rdma,information_md_media_primary_type,information_md_model,information_ds_interconnect_bandwidth,information_md_operating_system,information_ds_dpdk,information_client_interconnect_bandwidth,information_ds_media_primary_interface,information_md_cores_per_socket,information_ds_media_primary_capacity,information_md_media_secondary_type,information_ds_media_secondary_type,information_md_media_primary_vendor,information_md_media_primary_interface,information_md_media_primary_capacity,information_md_interconnect_type,information_ds_media_primary_type,information_md_sockets,score
1,SC19,"IST Austria HPC","IST Austria",Homemade@IST,BeeGFS,10,100,6.630000,1.390000,31.620000,18.800000,zip,1,sc19,2019-11-13,"Janos Kiss",11/8/19,,2019-09-02,,BeeGFS,7.1.3,10,Debian,"Debian 9 (stretch)",4.9.0-9-amd64,2,2,"NVMe Samsung PM1725A 6.4TB",128GB,NVMe,IB-EDR,"EXT4, BeeGFS 7.1.3","Debian 9 (stretch)",3,132,"HDD HGST_HUH721010ALE600 10TB 7200RPM",128GB,"PCI-e 3.0 x8 LSI9300-8e HBA 12Gbps SAS-SATA",IB-EDR,"ZFS 0.8.2, BeeGFS 7.1.3","Debian 9 (stretch)",,,5.650000,8.390000,0.230000,0.340000,31.210000,131.810000,39.340000,8.170000,18.720000,37.080000,9.750000,112.000000,,112.000000,,,2019-11-08-ISTAustriaBeeGFSBeeGFS-10-10.zip,1,11/8/19,,,https://github.com/IO500/submission-data/tree/master/IST%20Austria/IST%20Austria%20HPC/BeeGFS/2019/submission-187,,,,0,,,,0,,,,0,,,,0,,0,,,,,,,,,,,,,,,,,,,,,,,,,,,,,,,,,,0,,,0,,,,,,,,,,,,,,,,,,,,,,,,,,6.63
2,SC19,Sherlock/Regal,Stanford,Dell,Lustre,10,160,7.050000,1.640000,30.280000,19.300000,zip,1,sc19,2019-11-29,"Stanford Research Computing Center",11/8/19,,2013-05-28,2016-08-05,Sherlock/Regal,2.8.0,16,CentOS,7.6,3.10.0-957.27.2.el7.x86_64,1,1,HDD,128GB,SAS,Infiniband,2.8.0,6.7,18,108,NL-SAS7.2K,128GB,SAS,Infiniband,2.8.0,6.7,,,3.660000,6.680000,0.420000,0.710000,13.110000,129.690000,12.340000,11.730000,19.320000,41.740000,7.740000,460.000000,,460.000000,,,2019-11-08-StanfordSherlockRegalLustre-10-16.zip,1,11/8/19,,,https://github.com/IO500/submission-data/tree/master/Stanford/Sherlock/Regal/Sherlock/Regal/2019/submission-184,,,,0,,,,0,,,,0,,,,0,,0,,,,,,,,,,,,,,,,,,,,,,,,,,,,,,,,,,0,,,0,,,,,,,,,,,,,,,,,,,,,,,,,,7.05
3,SC19,Sherlock/Oak,Stanford,"Dell, QCT, HGST",Lustre,10,240,9.310000,1.890000,45.870000,26.680000,zip,1,sc19,2019-11-46,"Stanford Research Computing Center",11/8/19,,2016-11-01,2019-10-18,Oak,2.12.3,24,CentOS,7.6,3.10.0-957.27.2.el7.x86_64,2,2,SSD,3TB,SAS,Infiniband,2.10.8,7.6,8,180,NLSAS,0,SAS,Infiniband,2.10.8,7.6,,,7.150000,7.830000,0.230000,0.980000,15.430000,185.700000,20.640000,8.420000,46.750000,60.050000,15.320000,915.000000,,915.000000,,,2019-11-08-StanfordOakLustre-10-24.zip,,11/8/19,,,https://github.com/IO500/submission-data/tree/master/Stanford/Sherlock/Oak/Oak/2019/submission-166,,,,0,,,,0,,,,0,,,,0,,0,,,,,,,,,,,,,,,,,,,,,,,,,,,,,,,,,,0,,,0,,,,,,,,,,,,,,,,,,,,,,,,,,9.31
4,ISC20,SDumont,LNCC,Cay/HPE,Lustre,10,240,3.060000,2.320000,4.020000,5.640000,zip,1,isc20,2020-07-3,"AndrÃ© Ramos Carneiro",7/13/20,,2016-01-13,2020-04-13,scratch,2.12,24,"Red Hat Enterprise Linux Server",7.6,3.10.0-957.el7.x86_64,1,40,HDD,"64 GiB",SAS,"IB FDR",2.12,,10,40,HDD,"32 GiB",SAS,"IB FDR",2.12,,,,16.890000,14.550000,0.080000,1.560000,0.170000,13.590000,21.990000,0.170000,5.280000,15.360000,8.110000,12.000000,,12.000000,,,2020.07.10-16.18.50-scr.zip,,7/13/20,,https://www.vi4io.org/hpsl/2020/bra/LNCC/start,https://github.com/IO500/submission-data/tree/master/LNCC/SDumont/scratch/2020/submission-212,,,,0,,,,0,,,,0,,,,0,,0,,,,,,,,,,,,,,,,,,,,,,,,,,,,,,,,,,0,,,0,,,,,,,,,,,,,,,,,,,,,,,,,,3.06
5,SC19,nearline4,"Janelia Research Campus, HHMI",Qumulo,"Scale-out NAS",10,760,3.670000,2.450000,5.490000,7.070000,zip,1,sc19,2019-11-24,"Janelia Scientific Computing Systems",11/10/19,,112018,,"Qumulo FS",2.14.0.1,76,Scientific-Linux,7.6,3.10.0-957.10.1.el7.x86_64,0,3,SSD,,SATA,,,,40,480,HDD,64GB,SATA,10GbE,2.14.0.1,7.6,,,6.710000,8.320000,0.130000,4.990000,8.170000,147.780000,5.640000,0.180000,11.880000,10.280000,0.180000,31.000000,,31.000000,,,2019-11-10-JaneliaResearchCampusHowardHughesMedicalInstituteQumuloFSScale-outNAS-10-76.zip,1,11/10/19,,,https://github.com/IO500/submission-data/tree/master/Janelia%20Research%20Campus%2C%20HHMI/nearline4/Qumulo%20FS/2019/submission-208,,,,0,,,,0,,,,0,,,,0,,0,,,,,,,,,,,,,,,,,,,,,,,,,,,,,,,,,,0,,,0,,,,,,,,,,,,,,,,,,,,,,,,,,3.67
6,SC19,dm11,"Janelia Research Campus, HHMI",#N/A,"Scale-out NAS",10,760,6.420000,2.610000,15.820000,14.610000,zip,1,sc19,2019-11-43,"Janelia Scientific Computing Systems",11/10/19,,32018,,#N/A,8.1.2,76,Scientific-Linux,7.6,3.10.0-957.10.1.el7.x86_64,12,180,NAND,256GB,SAS,40GbE,8.1.2,7.6,56,840,HDD,128GB,SATA,40GbE,8.1.2,7.6,,,16.130000,13.390000,0.040000,5.950000,102.150000,290.650000,12.640000,0.990000,18.050000,13.610000,0.350000,123.000000,,123.000000,,,2019-11-10-JaneliaResearchCampusHowardHughesMedicalInstituteScale-outNAS-10-76.zip,1,11/10/19,,,https://github.com/IO500/submission-data/tree/master/Janelia%20Research%20Campus%2C%20HHMI/dm11/%23N/A/2019/submission-188,,,,0,,,,0,,,,0,,,,0,,0,,,,,,,,,,,,,,,,,,,,,,,,,,,,,,,,,,0,,,0,,,,,,,,,,,,,,,,,,,,,,,,,,6.42
7,SC19,BEAR-AI,"University of Birmingham",DDN,"Spectrum Scale",10,80,15.390000,2.740000,86.480000,46.090000,zip,1,sc19,2019-11-51,"Simon Thompson",11/10/19,,2019-04-01,2019-04-01,/ai,5.0.3.3,8,RHEL,7.6,4.14.0-115.7.1.el7a.ppc64le,0,0,,,,,,,4,20,NVMe,96GB,NVMe,Infiniband,5.0.2.3,"RHEL 7.6",,,8.880000,24.890000,0.540000,0.470000,103.110000,188.930000,51.040000,23.010000,124.970000,188.010000,11.720000,497.000000,,497.000000,,,2019-11-10-UniversityofBirminghamaiSpectrumScale-10-8.zip,,11/10/19,,,https://github.com/IO500/submission-data/tree/master/University%20of%20Birmingham/BEAR-AI//ai/2019/submission-138,,,,0,,,,0,,,,0,,,,0,,0,,,,,,,,,,,,,,,,,,,,,,,,,,,,,,,,,,0,,,0,,,,,,,,,,,,,,,,,,,,,,,,,,15.39
8,SC19,nrs,"Janelia Research Campus, HHMI",Qumulo,"Scale-out NAS",10,760,4.190000,2.880000,6.110000,8.010000,zip,1,sc19,2019-11-36,"Janelia Scientific Computing Systems",11/10/19,,92016,,"Qumulo FS",2.14.0.1,76,Scientific-Linux,7.6,3.10.0-957.10.1.el7.x86_64,0,13,SSD,,SATA,,,,20,520,HDD,128GB,SATA,40GbE,2.14.0.1,7.6,,,5.440000,13.370000,0.170000,5.710000,9.030000,171.200000,10.770000,0.210000,9.810000,9.070000,0.180000,35.000000,,35.000000,,,2019-11-10-JaneliaResearchCampusHowardHughesMedicalInstituteQumuloFSScale-outNAS-10-76.zip,1,11/10/19,,,https://github.com/IO500/submission-data/tree/master/Janelia%20Research%20Campus%2C%20HHMI/nrs/Qumulo%20FS/2019/submission-206,,,,0,,,,0,,,,0,,,,0,,0,,,,,,,,,,,,,,,,,,,,,,,,,,,,,,,,,,0,,,0,,,,,,,,,,,,,,,,,,,,,,,,,,4.19
9,ISC20,HAL,"National Center for Supercomputing Applications",DDN,"Spectrum Scale",10,100,11.310000,3.620000,35.370000,27.860000,zip,1,isc20,2020-07-26,"National Center for Supercomputing Applications",7/13/20,,09/2019,,HAL,5.0.5.0,10,CentOS,7.7,4.18.0-147.0.3.el7.ppc64le,8,2,NVMe,32,Infiniband,Infiniband,5.0.5.0,7.6,8,2,NVMe,32,Infiniband,Infiniband,5.0.5.0,7.6,,,14.860000,12.740000,0.430000,2.100000,71.460000,105.830000,33.260000,2.390000,65.370000,104.910000,0.460000,1300.000000,,1300.000000,,,2020.06.27-06.53.38-scr.zip,1,7/13/20,,,https://github.com/IO500/submission-data/tree/master/National%20Center%20for%20Supercomputing%20Applications/HAL/HAL/2020/submission-157,,,,0,,,,0,,,,0,,,,0,,0,,,,,,,,,,,,,,,,,,,,,,,,,,,,,,,,,,0,,,0,,,,,,,,,,,,,,,,,,,,,,,,,,11.31
10,SC19,TigerShark,SUSE,"SUSE, Intel, Lenovo","SUSE Enterprise Storage - CephFS",10,80,12.430000,4.640000,33.340000,29.100000,zip,1,sc19,2019-11-17,"David Byte",11/7/19,,2018-11-01,2018-10-01,,"6 (14.2.4)",8,"SUSE Linux Enterprise","15 SP1",4.12.14-197.21-default,15,1,NVME,32GB,NVMe,"100Gb Ethernet","6 (14.2.4)","15 SP1",10,119,SSD,96GB,SATA,"100Gb Ethernet","6 (14.2.4)","15 SP1",,,14.620000,7.720000,1.270000,3.230000,25.740000,105.160000,18.020000,9.290000,37.030000,41.550000,6.280000,349.000000,,349.000000,,,2019-11-07-SUSESUSEEnterpriseStorage-CephFS-10-8.zip,1,11/7/19,,,,,,,0,,,,0,,,,0,,,,0,,0,,,,,,,,,,,,,,,,,,,,,,,,,,,,,,,,,,0,,,0,,,,,,,,,,,,,,,,,,,,,,,,,,12.43
11,SC19,Sherlock/Fir,Stanford,"Dell, QCT, HGST",Lustre,10,240,18.250000,5.230000,63.740000,46.640000,zip,1,sc19,2019-11-28,"Stanford Research Computing Center",11/8/19,,2019-02-05,2019-10-16,Fir,2.12.3,24,CentOS,7.6,3.10.0-957.27.2.el7.x86_64,4,1,SSD,18TB,SAS,IB-HDR,2.12.3,7.6,16,96,NLSAS,0,SAS,IB-HDR,2.12.3,7.6,,,25.010000,23.230000,0.560000,2.290000,84.520000,354.370000,52.550000,20.930000,40.980000,34.230000,12.390000,475.000000,,475.000000,,,2019-11-08-StanfordFirLustre-10-24.zip,,11/8/19,,,https://github.com/IO500/submission-data/tree/master/Stanford/Sherlock/Fir/Fir/2019/submission-131,,,,0,,,,0,,,,0,,,,0,,0,,,,,,,,,,,,,,,,,,,,,,,,,,,,,,,,,,0,,,0,,,,,,,,,,,,,,,,,,,,,,,,,,18.25
12,SC19,Vast,"Janelia Research Campus, HHMI","Vast Data","Scale-out NAS",10,820,8.010000,6.310000,10.170000,14.610000,zip,1,sc19,2019-11-9,"Janelia Scientific Computing Systems",11/4/19,,12019,82019,Vast,2.0.1,82,Scientific-Linux,7.7,3.10.0-957.10.1.el7.x86_64,12,72,3DXP,256GB,NVME,50GbE,2.0.1,7.7,6,1320,Flash,64GB,NVMe,100GbE,2.0.1,7.7,,,12.350000,16.270000,1.740000,4.550000,15.630000,130.990000,31.140000,0.680000,7.610000,11.360000,0.820000,37.000000,,37.000000,,,2019-11-04-JaneliaResearchCampusHowardHughesMedicalInstituteScale-outNAS-10-82.zip,1,11/4/19,,,https://github.com/IO500/submission-data/tree/master/Janelia%20Research%20Campus%2C%20HHMI/Vast/Vast/2019/submission-174,,,,0,,,,0,,,,0,,,,0,,0,,,,,,,,,,,,,,,,,,,,,,,,,,,,,,,,,,0,,,0,,,,,,,,,,,,,,,,,,,,,,,,,,8.01
13,ISC20,HammerHead,SUSE,SUSE/Ampere/Arm,CephFS,10,220,15.610000,7.340000,33.220000,33.820000,zip,1,isc20,2020-07-2,"Darren Soothill",7/13/20,,2020-07-11,2020-07-11,"SUSE Enterprise Storage - CephFS",6,22,SUSE,"SLES 15 SP 1",4.12.14-197.37-default,12,4,NVMe,128G,Ethernet,Ethernet,6,"SLES 15 SP 1",10,4,NVMe,128G,Ethernet,Ethernet,6,"SLES 15 SP 1",,,12.660000,7.420000,2.530000,12.200000,21.390000,93.870000,18.170000,8.840000,28.060000,103.750000,5.630000,280.000000,,280.000000,,,2020.07.11-10.09.37-app.zip,,7/13/20,,,https://github.com/IO500/submission-data/tree/master/SUSE/HammerHead/SUSE%20Enterprise%20Storage%20-%20CephFS/2020/submission-136,,,,0,,,,0,,,,0,,,,0,,0,,,,,,,,,,,,,,,,,,,,,,,,,,,,,,,,,,0,,,0,,,,,,,,,,,,,,,,,,,,,,,,,,15.61
14,SC19,Hadley,"Nanyang Technological University",DDN,GPFS,10,640,12.890000,7.470000,22.240000,26.030000,zip,1,sc19,2019-11-38,"Rikky Purbojati",9/27/19,,2019-09-27,,GPFS,4.2.3.9,64,CentOS,7.5.1804,3.10.0-862.2.3.el7.x86_64,0,0,,,,,,,0,0,,,,,,,,,29.930000,37.230000,0.820000,3.390000,39.580000,61.870000,31.980000,9.180000,13.830000,14.400000,4.650000,90.000000,,90.000000,,,2019-09-27-NanyangTechnologicalUniversityGPFSGPFS-10-64.zip,,9/27/19,,,https://github.com/IO500/submission-data/tree/master/Nanyang%20Technological%20University/Hadley/GPFS/2019/submission-146,,,,0,,,,0,,,,0,,,,0,,0,,,,,,,,,,,,,,,,,,,,,,,,,,,,,,,,,,0,,,0,,,,,,,,,,,,,,,,,,,,,,,,,,12.89
15,ISC20,"MOGON II","Johannes Gutenberg University Mainz","JGU (ADA-FS)& BSC (NEXTGenIO)",GekkoFS,10,160,96.460000,11.610000,801.600000,329.100000,zip,1,isc20,2020-07-19,"Marc-AndrÃ© Vef",7/13/20,,2017-10-01,,GekkoFS,0.8dev,16,CentOS,,3.10.0-1127.8.2.el7.x86_64,200,1,"Intel SSD DC S4600 Series",,SATA,Omnipath,0.8dev,,200,1,"Intel SSD DC S4600 Series",,SATA,Omnipath,0.8dev,,,,63.110000,22.490000,2.870000,4.460000,1462.020000,1454.740000,782.980000,249.100000,284.090000,1493.590000,273.360000,3543.000000,,3543.000000,,,2020.07.13-23.48.39-scr.zip,1,7/13/20,,,https://github.com/IO500/submission-data/tree/master/Johannes%20Gutenberg%20University%20Mainz/MOGON%20II/GekkoFS/2020/submission-50,,,,0,,,,0,,,,0,,,,0,,0,,,,,,,,,,,,,,,,,,,,,,,,,,,,,,,,,,0,,,0,,,,,,,,,,,,,,,,,,,,,,,,,,96.46
16,ISC20,SharedScratch,"Janelia Research Campus, HHMI",WekaIO,"Parallel Filesystem",10,600,31.390000,12.340000,79.830000,72.170000,zip,1,isc20,2020-07-24,"Janelia Scientific Computing Systems",7/13/20,,2/2019,,wekafs,3.7.0,60,Scientific-Linux,7.7,3.10.0-1062.9.1.el7.x86_64,0,0,,,,,,,20,80,Flash,192GB,NVMe,100GbE,3.7.0,7.7,,,11.710000,22.590000,9.000000,9.740000,33.730000,1088.990000,32.470000,14.510000,91.440000,147.390000,17.360000,408.000000,,408.000000,,,2020.06.02-08.56.31-app.zip,1,7/13/20,,,https://github.com/IO500/submission-data/tree/master/Janelia%20Research%20Campus%2C%20HHMI/SharedScratch/wekafs/2020/submission-111,,,,0,,,,0,,,,0,,,,0,,0,,,,,,,,,,,,,,,,,,,,,,,,,,,,,,,,,,0,,,0,,,,,,,,,,,,,,,,,,,,,,,,,,31.39
17,SC19,"Palmetto Burstbuffer","Clemson University",AdvancedHPC,BeeGFS,10,120,21.550000,12.970000,35.800000,42.990000,zip,1,sc19,2019-11-34,"Clemson University ACI",11/1/19,,2019-05-01,,burstbuffer,7.1.3,12,"Oracle Linux",7.6,4.1.12-103.9.4.el7uek.x86_64,4,2,NVMe,512GB,NVMe,EDR,7.1.3,7.7,4,24,NVMe,512GB,NVMe,EDR,7.1.3,7.7,,,20.870000,29.590000,3.510000,13.060000,34.390000,190.590000,48.810000,3.910000,15.520000,55.580000,2.610000,957.000000,,957.000000,,,2019-11-01-ClemsonUniversityburstbufferBeeGFS-10-12.zip,1,11/1/19,,,https://github.com/IO500/submission-data/tree/master/Clemson%20University/Palmetto%20Burstbuffer/burstbuffer/2019/submission-124,,,,0,,,,0,,,,0,,,,0,,0,,,,,,,,,,,,,,,,,,,,,,,,,,,,,,,,,,0,,,0,,,,,,,,,,,,,,,,,,,,,,,,,,21.55
18,SC19,iFLYTEK,iFLYTEK,Yanrong,YRCloudFile,10,200,78.540000,13.550000,455.180000,237.640000,zip,1,sc19,2019-11-10,Yanrong,11/1/19,,09/2019,10/2019,YRCloudFile,6.0,20,CentOS,7.4,4.12.14,20,1,NVMe,128GB,NVMe,"IB EDR",,7.4,10,2,NVMe,128GB,NVMe,"IB EDR",,7.4,,,33.180000,10.960000,6.190000,14.990000,268.010000,1084.310000,199.000000,179.910000,241.760000,909.830000,258.900000,3110.000000,,3110.000000,,,2019-11-01-iFLYTEKYRCloudFileYRCloudFile-10-20.zip,,11/1/19,,,https://github.com/IO500/submission-data/tree/master/iFLYTEK/iFLYTEK/YRCloudFile/2019/submission-59,,,,0,,,,0,,,,0,,,,0,,0,,,,,,,,,,,,,,,,,,,,,,,,,,,,,,,,,,0,,,0,,,,,,,,,,,,,,,,,,,,,,,,,,78.54
19,ISC20,"BeeGFS on Oracle Cloud","Oracle Cloud Infrastructure","Oracle Cloud Infrastructure",BeeGFS,10,160,32.790000,14.020000,76.670000,73.310000,zip,1,isc20,2020-07-7,"PINKESH VALDRIA",7/13/20,,2020-06-15,2020-06-15,10-nodes-HPC-Cluster,7.1.5,16,"Oracle Linux UEK",7.7,4.14.35-1902.6.6.el7uek.x86_64,10,1,NVMe,"384 GB",NVMe,Ethernet,7.1.5,OracleLinuxUEK77,10,10,NVMe,"384 GB",NVMe,Ethernet,7.1.5,OracleLinuxUEK77,,,26.060000,27.220000,3.000000,18.180000,163.200000,720.730000,327.700000,3.020000,17.660000,61.230000,9.610000,987.000000,,987.000000,,,2020.07.09-12.23.20-scr.zip,1,7/13/20,,,https://github.com/IO500/submission-data/tree/master/Oracle%20Cloud%20Infrastructure/BeeGFS%20on%20Oracle%20Cloud/10-nodes-HPC-Cluster/2020/submission-108,,,,0,,,,0,,,,0,,,,0,,0,,,,,,,,,,,,,,,,,,,,,,,,,,,,,,,,,,0,,,0,,,,,,,,,,,,,,,,,,,,,,,,,,32.79
20,SC19,Penguin-ASG-NVBeeOne,"Penguin Computing Benchmarking and Innovation Lab","Penguin Computing/Excelero",BeeGFS,10,320,39.650000,17.710000,88.760000,87.370000,zip,1,sc19,2019-11-18,"Kevin Tubbs",11/12/19,2019-11-11,2019-08-12,2019-08-12,BeeGFS-NVMesh,7.1.3,32,RHEL,7.6,3.10.0-957.27.2.el7.x86_64,8,4,NVMe,,EDR,EDR,7.1.3,"RHEL 7.6",8,72,NVMe,,NVMe,EDR,7.1.3,"RHEL 7.6",,,30.960000,57.520000,1.760000,31.460000,156.840000,1681.390000,120.220000,7.850000,25.480000,107.330000,7.330000,772.000000,,772.000000,,,2019-11-12-PenguinComputingBenchmarkingandInnovationLabBeeGFS-NVMeshBeeGFS-10-32.zip,1,11/12/19,,,https://github.com/IO500/submission-data/tree/master/Penguin%20Computing%20Benchmarking%20and%20Innovation%20Lab/Penguin-ASG-NVBeeOne/BeeGFS-NVMesh/2019/submission-98,,,,0,,,,0,,,,0,,,,0,,0,,,,,,,,,,,,,,,,,,,,,,,,,,,,,,,,,,0,,,0,,,,,,,,,,,,,,,,,,,,,,,,,,39.65
21,SC19,SharedScratch,"Janelia Research Campus, HHMI",WekaIO,"Parallel Filesystem",10,1440,36.550000,18.580000,71.900000,77.140000,zip,1,sc19,2019-11-26,"Janelia Scientific Computing Systems",11/8/19,,22019,,wekafs,3.5.2,144,Scientific-Linux,7.7,3.10.0-957.10.1.el7.x86_64,0,0,,,,,,,20,80,Flash,96GB,NVMe,100GbE,3.5.2,7.7,,,27.190000,16.000000,12.060000,22.730000,34.640000,2295.840000,33.410000,9.710000,111.380000,43.150000,8.880000,648.000000,,648.000000,,,2019-11-08-JaneliaResearchCampusHowardHughesMedicalInstitutewekafswekaio-10-144.zip,1,11/8/19,,,https://github.com/IO500/submission-data/tree/master/Janelia%20Research%20Campus%2C%20HHMI/SharedScratch/wekafs/2019/submission-102,,,,0,,,,0,,,,0,,,,0,,0,,,,,,,,,,,,,,,,,,,,,,,,,,,,,,,,,,0,,,0,,,,,,,,,,,,,,,,,,,,,,,,,,36.55
22,SC19,AI400,DDN,DDN,Lustre,10,240,63.880000,19.650000,207.630000,159.380000,zip,1,sc19,2019-11-7,"Shuichi Ihara",11/10/19,,,,AI400,2.12.58,24,CentOS,8.0,4.18.0-80.el8.x86_64,2,0,SSD,64GB,NVMe,Infiniband,2.12.58,CentOS7.6,2,12,SSD,64GB,NVMe,Infiniband,2.12.58,CentOS7.6,,,28.620000,41.720000,2.960000,42.190000,152.840000,451.970000,132.760000,79.650000,172.590000,449.930000,75.150000,810.000000,,810.000000,,,2019-11-10-DDNAI400Lustre-10-24.zip,1,11/10/19,,,https://github.com/IO500/submission-data/tree/master/DDN/AI400/AI400/2019/submission-75,,,,0,,,,0,,,,0,,,,0,,0,,,,,,,,,,,,,,,,,,,,,,,,,,,,,,,,,,0,,,0,,,,,,,,,,,,,,,,,,,,,,,,,,63.88
23,ISC20,AI400X,DDN,DDN,Lustre,10,160,69.920000,21.010000,232.700000,175.830000,zip,1,isc20,2020-07-13,"Shuichi Ihara",7/13/20,,2020-06-30,2020-06-30,Exascaler,2.13.53,16,CentOS,8.1,4.18.0-147.8.1.el8_1.x86_64,0,0,0,0,0,0,0,0,2,10,NVMe,3.84TB,NVMe,IB-EDR,2.13.53,CentOS7.7,,,37.560000,45.950000,2.770000,40.810000,157.220000,453.510000,135.090000,90.470000,169.000000,446.750000,76.940000,1698.000000,,1698.000000,,,2020.07.13-07.46.20-scr.zip,1,7/13/20,,,https://github.com/IO500/submission-data/tree/master/DDN/AI400X/Exascaler/2020/submission-66,,,,0,,,,0,,,,0,,,,0,,0,,,,,,,,,,,,,,,,,,,,,,,,,,,,,,,,,,0,,,0,,,,,,,,,,,,,,,,,,,,,,,,,,69.92
24,SC19,NextGENIO,EPCC,"NextGenIO (BSC & JGU)",GekkoFS,10,240,125.080000,21.470000,728.680000,379.100000,zip,1,sc19,2019-11-2,"BSC Storage Team",10/6/19,,2019-01-01,2019-01-01,GekkoFS,0.6dev,24,CentOS,el7,3.10.0-862.14.4.el7.x86_64,33,2,"Intel DCPMM",2TB,,Omnipath,,,33,2,"Intel DCPMM",2,,Omnipath,,,,,67.810000,38.390000,3.490000,23.390000,1733.370000,1718.610000,891.280000,194.590000,496.410000,1625.070000,313.650000,608.000000,,608.000000,,,2019-10-06-EPCCGekkoFSAdhocFilesystem-10-24.zip,1,10/6/19,,,https://github.com/IO500/submission-data/tree/master/EPCC/NextGENIO/GekkoFS/2019/submission-39,,,,0,,,,0,,,,0,,,,0,,0,,,,,,,,,,,,,,,,,,,,,,,,,,,,,,,,,,0,,,0,,,,,,,,,,,,,,,,,,,,,,,,,,125.08
25,SC19,"Data Accelerator","University of Cambridge","Dell EMC",Lustre,10,320,60.250000,21.730000,167.090000,142.590000,zip,1,sc19,2019-11-6,"University of Cambridge",11/10/19,,2018-05-01,,/dac,"2.13 (tip of master branch as of running)",32,CentOS,7.7,3.10.0-957.10.1.el7.x86_64,24,1,NVMe,192GiB,NVMe,"OPA (2x OPA HFIs per server)","2.13 (tip of master branch as of running)","CentoS 7.7",24,288,NVMe,192GiB,NVMe,"OPA (2x OPA HFIs per server)","2.13 (tip of master branch as of running)","CentoS 7.7",,,142.400000,106.330000,3.180000,4.620000,435.700000,1184.270000,129.620000,29.810000,59.010000,65.400000,10.740000,7349.000000,,7349.000000,,,2019-11-10-UniversityofCambridgedacLustre-10-32.zip,1,11/10/19,,https://www.vi4io.org/hpsl/2019/gbr/universityofcambridge/start,https://github.com/IO500/submission-data/tree/master/University%20of%20Cambridge/Data%20Accelerator//dac/2019/submission-78,,,,0,,,,0,,,,0,,,,0,,0,,,,,,,,,,,,,,,,,,,,,,,,,,,,,,,,,,0,,,0,,,,,,,,,,,,,,,,,,,,,,,,,,60.25
26,ISC20,NextGENIO,EPCC,"NextGenIO (BSC & JGU)",GekkoFS,10,280,152.300000,24.830000,934.120000,469.590000,zip,1,isc20,2020-07-8,"Ramon Nou",7/13/20,,2019-01-01,2020-06-29,GekkoFS,0.8dev,28,CentOS,,3.10.0-862.14.4.el7.x86_64,28,2,3DXPNVMeSSDv,2,NVMe,Omnipath,0.8dev,,28,2,3DXPNVMeSSD,2,NVMe,Omnipath,0.8dev,,,,64.150000,71.440000,3.450000,24.060000,1880.280000,1841.930000,981.050000,187.320000,547.290000,1773.110000,299.220000,3137.000000,,3137.000000,,,2020.07.14-08.49.39-scr.zip,1,7/13/20,,,https://github.com/IO500/submission-data/tree/master/EPCC/NextGENIO/GekkoFS/2020/submission-31,,,,0,,,,0,,,,0,,,,0,,0,,,,,,,,,,,,,,,,,,,,,,,,,,,,,,,,,,0,,,0,,,,,,,,,,,,,,,,,,,,,,,,,,152.3
27,ISC20,EC2-10xi3en.metal,"Red Hat","Red Hat",CephFS,10,320,57.170000,26.290000,124.300000,124.750000,zip,1,isc20,2020-07-41,"Red Hat",7/13/20,,2020-07-05,,,"Master (e9cc7d86)",32,Fedora,31,5.7.6-201.fc32.x86_64,10,8,NVMe,768GB,NVMe,100GbE,,"Fedora 31",10,8,NVMe,768GB,,,,"Fedora 31",,,36.260000,75.620000,9.140000,19.080000,191.980000,903.110000,123.450000,17.190000,87.510000,97.400000,18.810000,966.000000,,966.000000,,,2020.07.07-20.27.19-scr.zip,1,7/13/20,,,,,,,0,,,,0,,,,0,,,,0,,0,,,,,,,,,,,,,,,,,,,,,,,,,,,,,,,,,,0,,,0,,,,,,,,,,,,,,,,,,,,,,,,,,57.17