id,release_id,information_system,information_institution,information_storage_vendor,information_filesystem_type,information_client_nodes,information_client_total_procs,io500_score,io500_bw,io500_md,io500_tot_iops,information_data,information_10_node_challenge,information_list_name,information_identifier,information_submitter,information_submission_date,information_embargo_end_date,information_storage_install_date,information_storage_refresh_date,information_filesystem_name,information_filesystem_version,information_client_procs_per_node,information_client_operating_system,information_client_operating_system_version,information_client_kernel_version,information_md_nodes,information_md_storage_devices,information_md_storage_type,information_md_volatile_memory_capacity,information_md_storage_interface,information_md_network,information_md_software_version,information_md_operating_system_version,information_ds_nodes,information_ds_storage_devices,information_ds_storage_type,information_ds_volatile_memory_capacity,information_ds_storage_interface,information_ds_network,information_ds_software_version,information_ds_operating_system_version,information_note,information_best,ior_easy_write,ior_easy_read,ior_hard_write,ior_hard_read,mdtest_easy_write,mdtest_easy_stat,mdtest_easy_delete,mdtest_hard_write,mdtest_hard_read,mdtest_hard_stat,mdtest_hard_delete,find_easy,find_hard,find_mixed,marker_score,marker_md,storage_data,include_in_io500,valid_from,valid_to,cdcl_url,repository_url,user_id,result_tar,result_tar_dir,result_tar_size,result_tar_type,job_script,job_script_dir,job_script_size,job_script_type,job_output,job_output_dir,job_output_size,job_output_type,system_information,system_information_dir,system_information_size,system_information_type,information_client_sockets,information_ds_clock,information_ds_media_secondary_count,information_ds_media_primary_vendor,information_ds_model,information_ds_media_secondary_capacity,information_md_spdk,information_md_media_secondary_vendor,information_ds_kernel_version,status_old,information_client_interconnect_vendor,information_ds_interconnect_rdma,information_ds_media_secondary_vendor,status_id,information_client_dpdk,information_md_interconnect_links,information_md_dpdk,information_ds_architecture,information_md_interconnect_vendor,information_ds_interconnect_links,information_client_interconnect_type,information_ds_cores_per_socket,information_md_media_primary_count,information_md_media_secondary_count,information_client_spdk,information_md_media_secondary_capacity,information_md_kernel_version,information_ds_interconnect_type,information_ds_interconnect_vendor,information_md_architecture,information_ds_sockets,information_md_interconnect_rdma,information_client_model,information_md_media_secondary_interface,information_client_interconnect_links,information_ds_operating_system,information_ds_spdk,information_client_cores_per_socket,information_md_interconnect_bandwidth,information_client_volatile_memory_capacity,information_client_clock,information_ds_media_secondary_interface,information_md_clock,information_ds_media_primary_count,information_client_architecture,information_client_interconnect_rdma,information_md_media_primary_type,information_md_model,information_ds_interconnect_bandwidth,information_md_operating_system,information_ds_dpdk,information_client_interconnect_bandwidth,information_ds_media_primary_interface,information_md_cores_per_socket,information_ds_media_primary_capacity,information_md_media_secondary_type,information_ds_media_secondary_type,information_md_media_primary_vendor,information_md_media_primary_interface,information_md_media_primary_capacity,information_md_interconnect_type,information_ds_media_primary_type,information_md_sockets,score
1,SC21,Kongming,"BPFS Lab",,BPFS,10,800,972.603929,96.260247,9827.093046,0.000000,,1,sc21,7.04806058185321E+017,,10/31/21,,,,BPFS,,80,CentOS,7.5,4.14,0,0,,,,,,,35,280,SSD,,NVMe,Ethernet,,,,,91.347802,75.765181,106.138701,116.881653,7050.545698,11081.175060,7893.367693,3485.201281,4086.084567,10336.178180,8042.844092,119131.006300,,119131.006300,-,-,2021.10.31-19.21.04.zip,1,11/19/21,,,https://github.com/IO500/submission-data/tree/master/BPFS%20Lab/Kongming/BPFS/2021/submission-588,,,,0,,,,0,,,,0,,,,0,,0,,,,,,,,,,,,,,,,,,,,,,,,,,,,,,,,,,0,,,0,,,,,,,,,,,,,,,,,,,,,,,,,,972.60400390625
2,ISC20,"BeeGFS on Oracle Cloud","Oracle Cloud Infrastructure","Oracle Cloud Infrastructure",BeeGFS,270,3240,267.250000,293.050000,243.730000,436.550000,zip,,isc20,2020-07-40,"PINKESH VALDRIA",7/13/20,,2020-06-19,2020-06-19,HPC-FS-Cluster,7.1.5,12,"Oracle Linux UEK",7.7,4.14.35-1902.6.6.el7uek.x86_64,270,1,NVMe,"384 GB",NVMe,Ethernet,7.1.5,OracleLinuxUEK77,270,1,NVMe,"384 GB",NVMe,Ethernet,7.1.5,OracleLinuxUEK77,,,465.690000,665.580000,67.570000,352.150000,2888.240000,13150.100000,4880.110000,1.820000,17.630000,30.920000,7.950000,8524.000000,,8524.000000,,,2020.07.14-01.17.59-scr.zip,1,7/13/20,,,https://github.com/IO500/submission-data/tree/master/Oracle%20Cloud%20Infrastructure/BeeGFS%20on%20Oracle%20Cloud/HPC-FS-Cluster/2020/submission-21,,,,0,,,,0,,,,0,,,,0,,0,,,,,,,,,,,,,,,,,,,,,,,,,,,,,,,,,,0,,,0,,,,,,,,,,,,,,,,,,,,,,,,,,267.25
3,SC19,TStor3000,"State Key Laboratory of High-end Server & Storage Technology (HSS)",INSPUR,BeeGFS,10,300,82.570000,41.140000,165.710000,175.430000,zip,1,sc19,2019-11-14,,11/7/19,,2019-10-10,2019-11-01,beegfs,7.1.3,30,Linux,CentOS7.6,3.10.0-957.el7.x86_64,24,3,AEP,384GB,AEP,EDR,7.1.3,CentOS7.6,24,192,NVME,384GB,NVME,EDR,7.1.3,CentOS7.6,,,105.100000,97.260000,6.430000,43.560000,478.030000,2621.060000,762.010000,8.470000,26.920000,121.680000,11.870000,1810.000000,,1810.000000,,,2019-11-07-StateKeyLaboratoryofHigh-endServerStorageTechnologyHSSbeegfsBeeGFS-10-30.zip,1,11/7/19,,,https://github.com/IO500/submission-data/tree/master/State%20Key%20Laboratory%20of%20High-end%20Server%20%26%20Storage%20Technology%20%28HSS%29/TStor3000/beegfs/2019/submission-58,,,,0,,,,0,,,,0,,,,0,,0,,,,,,,,,,,,,,,,,,,,,,,,,,,,,,,,,,0,,,0,,,,,,,,,,,,,,,,,,,,,,,,,,82.569999694824
4,SC19,Penguin-ASG-NVBeeOne,"Penguin Computing Benchmarking and Innovation Lab","Penguin Computing/Excelero",BeeGFS,10,320,39.650000,17.710000,88.760000,87.370000,zip,1,sc19,2019-11-18,"Kevin Tubbs",11/12/19,2019-11-11,2019-08-12,2019-08-12,BeeGFS-NVMesh,7.1.3,32,RHEL,7.6,3.10.0-957.27.2.el7.x86_64,8,4,NVMe,,EDR,EDR,7.1.3,"RHEL 7.6",8,72,NVMe,,NVMe,EDR,7.1.3,"RHEL 7.6",,,30.960000,57.520000,1.760000,31.460000,156.840000,1681.390000,120.220000,7.850000,25.480000,107.330000,7.330000,772.000000,,772.000000,,,2019-11-12-PenguinComputingBenchmarkingandInnovationLabBeeGFS-NVMeshBeeGFS-10-32.zip,1,11/12/19,,,https://github.com/IO500/submission-data/tree/master/Penguin%20Computing%20Benchmarking%20and%20Innovation%20Lab/Penguin-ASG-NVBeeOne/BeeGFS-NVMesh/2019/submission-98,,,,0,,,,0,,,,0,,,,0,,0,,,,,,,,,,,,,,,,,,,,,,,,,,,,,,,,,,0,,,0,,,,,,,,,,,,,,,,,,,,,,,,,,39.650001525879
5,SC19,"Palmetto Burstbuffer","Clemson University",AdvancedHPC,BeeGFS,10,120,21.550000,12.970000,35.800000,42.990000,zip,1,sc19,2019-11-34,"Clemson University ACI",11/1/19,,2019-05-01,,burstbuffer,7.1.3,12,"Oracle Linux",7.6,4.1.12-103.9.4.el7uek.x86_64,4,2,NVMe,512GB,NVMe,EDR,7.1.3,7.7,4,24,NVMe,512GB,NVMe,EDR,7.1.3,7.7,,,20.870000,29.590000,3.510000,13.060000,34.390000,190.590000,48.810000,3.910000,15.520000,55.580000,2.610000,957.000000,,957.000000,,,2019-11-01-ClemsonUniversityburstbufferBeeGFS-10-12.zip,1,11/1/19,,,https://github.com/IO500/submission-data/tree/master/Clemson%20University/Palmetto%20Burstbuffer/burstbuffer/2019/submission-124,,,,0,,,,0,,,,0,,,,0,,0,,,,,,,,,,,,,,,,,,,,,,,,,,,,,,,,,,0,,,0,,,,,,,,,,,,,,,,,,,,,,,,,,21.549999237061
6,SC21,SCC,GWDG,,BeeGFS,10,80,12.549643,2.631452,59.850429,0.000000,,1,sc21,3.83533251860745E+017,,10/26/21,,,,BeeGFS,,8,scientific,7.9,3.10.0-1160.24.1.el7.x86_64,2,2,,,SAS3,OPA,,,2,8,SSD,192,,Omni-Path,,,,,3.261078,8.852841,0.348750,4.762372,52.889747,309.023172,58.292741,11.789431,25.880817,76.652839,12.372046,597.201043,,597.201043,-,-,2021.10.24-18.15.48.zip,,11/19/21,,,https://github.com/IO500/submission-data/tree/master/GWDG/SCC/BeeGFS/2021/submission-582,,,,0,,,,0,,,,0,,,,0,,0,,,,,,,,,,,,,,,,,,,,,,,,,,,,,,,,,,0,,,0,,,,,,,,,,,,,,,,,,,,,,,,,,12.549599647522
7,ISC21,Cygnus,"University of Tsukuba",OSS,CHFS,10,240,148.689189,30.385217,727.606276,,,,isc21,,"Osamu Tatebe",6/7/21,,,,CHFS,,24,CentOS,7.9,3.1,,,,,,,,,68,,,,,,,,,,71.693064,71.836846,12.144590,13.628314,1582.615900,1955.423375,656.241600,258.633235,841.245150,602.414994,279.392210,,,1056.268758,,,2021.05.24-00.05.20.zip,1,,,,https://github.com/IO500/submission-data/tree/master/University%20of%20Tsukuba/Cygnus/CHFS/2021/submission-541,,,,0,,,,0,,,,0,,,,0,,0,,,,,,,,,,,,,,,,,,,,,,,,,,,,,,,,,,0,,,0,,,,,,,,,,,,,,,,,,,,,,,,,,148.68899536133
8,ISC20,EC2-10xi3en.metal,"Red Hat","Red Hat",CephFS,10,320,57.170000,26.290000,124.300000,124.750000,zip,1,isc20,2020-07-41,"Red Hat",7/13/20,,2020-07-05,,,"Master (e9cc7d86)",32,Fedora,31,5.7.6-201.fc32.x86_64,10,8,NVMe,768GB,NVMe,100GbE,,"Fedora 31",10,8,NVMe,768GB,,,,"Fedora 31",,,36.260000,75.620000,9.140000,19.080000,191.980000,903.110000,123.450000,17.190000,87.510000,97.400000,18.810000,966.000000,,966.000000,,,2020.07.07-20.27.19-scr.zip,1,7/13/20,,,,,,,0,,,,0,,,,0,,,,0,,0,,,,,,,,,,,,,,,,,,,,,,,,,,,,,,,,,,0,,,0,,,,,,,,,,,,,,,,,,,,,,,,,,57.169998168945
9,ISC21,Endeavour,Intel,Intel,DAOS,10,1440,1859.556390,398.765034,8671.647896,,,,isc21,,"Mohamad Chaarawi",6/9/21,,2020-09,,DAOS,1.3.101,144,CentOS,,4.18.0-240.22.1.el8_3.crt2.x86_64,,12,,,,,,,40,8,PMEM,,NVDIMM,"Infiniband, 200 GBit",,7,,,538.829306,586.050057,389.251396,205.708472,13347.628000,12962.256060,7556.862360,6278.339486,10042.811820,12320.820540,5489.515231,,,5734.732097,,,2021.05.31-18.01.25.zip,1,,,,https://github.com/IO500/submission-data/tree/master/Intel/Endeavour/DAOS/2021/submission-554,,,,0,,,,0,,,,0,,,,0,,0,,,,,,,,,,,,,,,,,,,,,,,,,,,,,,,,,,0,,,0,,,,,,,,,,,,,,,,,,,,,,,,,,1859.5600585938
10,ISC20,Wolf,Intel,Intel,DAOS,52,1664,1792.980000,371.670000,8649.570000,5103.140000,zip,,isc20,2020-07-23,Intel,7/13/20,,,,DAOS,1.1,32,CentOS,7.7,3.10.0-1062.12.1.el7.x86_64,0,0,,,,,,,30,60,"Optane Persistent Memory",512GB,DDR-T,Omnipath,1.1,7.7,,,243.640000,575.590000,261.220000,520.920000,12326.300000,11928.800000,6897.990000,5646.530000,8620.140000,10723.200000,6695.910000,8838.000000,,8838.000000,,,2020.06.28-19.21.15-scr.zip,1,7/13/20,,,https://github.com/IO500/submission-data/tree/master/Intel/Wolf/DAOS/2020/submission-1,,,,0,,,,0,,,,0,,,,0,,0,,,,,,,,,,,,,,,,,,,,,,,,,,,,,,,,,,0,,,0,,,,,,,,,,,,,,,,,,,,,,,,,,1792.9799804688
11,ISC22,"SuperMUC-NG Phase2",LRZ,Lenovo,DAOS,20,1280,1371.295669,321.752860,5844.398129,,,,,,jeanlucabez@gmail.com,5/12/22,,,,"DAOS on Lenovo SR630v2 ",2.0.2-2,,"SUSE Enterprise",15.3,5.3.18-57-default,,,,,,,,,,,,,,,,,,,502.682357,622.699940,211.238256,162.085671,11507.900423,12559.996455,3819.713293,3289.384745,7705.524764,9232.451364,2912.295378,,,3617.700603,,,,1,,,,,e8d646eb-fb55-45c8-b3e6-0cdd84c8a28d,io500.tgz,webroot/files/submissions/f548069e2c4beb88a9cd7ec7b0d65bcd779f8daf/,257228,application/x-compressed-tar,,,0,,,,0,,site.json,webroot/files/submissions/706a1453d6a9c4ce6b75da80ba46aedda73d3848/,10618,application/json,0,,,,,,,,,,,,,,,,,,,,,,,,,,,,,,,,,,0,,,0,,,,,,,,,,,,,,,,,,,,,,,,,,1371.2956542969
12,ISC22,Cumulus,"University of Cambridge",Dell/Intel,DAOS,200,2000,1107.174140,283.189223,4328.676643,,,,,,jeanlucabez@gmail.com,5/19/22,,,,DAC2-DAOS,"DAOS 2.0.2",,RedHat,8,,,,,,,,,,,,,,,,,,,,350.190839,441.837728,153.315455,271.114892,6953.459189,8358.854734,2311.551904,1907.187617,5162.589298,6606.467789,2059.136103,,,6849.745730,,,,1,,,,,e8d646eb-fb55-45c8-b3e6-0cdd84c8a28d,io500.tgz,webroot/files/submissions/8438156c814af3304b0d0747bc8ce0c3bcfd2253/,358780,application/x-compressed-tar,job.sh,webroot/files/submissions/8438156c814af3304b0d0747bc8ce0c3bcfd2253/,4169,application/x-shellscript,,,0,,site.json,webroot/files/submissions/08acd457851dafa329127f3efd9f41a1ce24d1e1/,10335,application/json,0,,,,,,,,,,,,,,,,,,,,,,,,,,,,,,,,,,0,,,0,,,,,,,,,,,,,,,,,,,,,,,,,,1107.1741943359
13,ISC21,Lenovo-Lenox,Lenovo,Lenovo,DAOS,36,3456,988.989572,176.373760,5545.611607,,,,isc21,,,6/11/21,,2020-04,,Lenovo,1.3.101-2,96,CentOS,7.7.1908,3.10.0-1062.18.1.el7.x86_64,,12,,,,,,,12,8,PMEM,,NVDIMM,"Infiniband, 100 GBit, 2x",,7.9.2009,,,169.812184,195.352199,147.996627,197.104677,6968.232917,11212.083410,3869.981600,2114.924660,5775.439193,8835.444564,3918.497644,,,6996.000113,,,2021.06.11-18.55.05.zip,1,,,,https://github.com/IO500/submission-data/tree/master/Lenovo/Lenovo-Lenox/Lenovo/2021/submission-546,,,,0,,,,0,,,,0,,,,0,,0,,,,,,,,,,,,,,,,,,,,,,,,,,,,,,,,,,0,,,0,,,,,,,,,,,,,,,,,,,,,,,,,,988.98999023438
14,ISC20,Frontera,TACC,Intel,DAOS,60,1440,763.800000,78.310000,7449.560000,2748.860000,zip,,isc20,2020-07-29,Intel,7/13/20,,,,DAOS,1.1,24,CentOS,7.8,3.10.0-1127.13.1.el7.x86_64,0,0,,,,,,,16,24,"Optane Persistent Memory",256GB,DDR-T,Infiniband,1.1,7.8,,,90.840000,75.750000,76.330000,71.620000,11306.000000,11124.800000,6542.630000,5015.780000,7406.070000,9156.060000,5949.250000,5696.000000,,5696.000000,,,2020.07.12-20.45.38-scr.zip,1,7/13/20,,,https://github.com/IO500/submission-data/tree/master/TACC/Frontera/DAOS/2020/submission-5,,,,0,,,,0,,,,0,,,,0,,0,,,,,,,,,,,,,,,,,,,,,,,,,,,,,,,,,,0,,,0,,,,,,,,,,,,,,,,,,,,,,,,,,763.79998779297
15,ISC22,Lenovo-Lenox3,Lenovo,Lenovo,DAOS,20,1440,624.587560,145.119327,2688.198933,,,,,,jeanlucabez@gmail.com,5/12/22,,,,"DAOS on Lenovo SR630v2 ",2.0.2-2,,CentOS,8.4.2105,4.18.0-305.25.1.el8_4.x86_64,,,,,,,,,,,,,,,,,,,148.108205,225.569757,97.443062,136.235443,4373.889760,4910.287373,1444.268155,1282.356374,2989.263357,3699.173274,1390.957385,,,4457.355202,,,,1,,,,,e8d646eb-fb55-45c8-b3e6-0cdd84c8a28d,io500.tgz,webroot/files/submissions/ac0550b3f77f0cf3097e106ba9f54dfb229774ec/,279765,application/x-compressed-tar,,,0,,,,0,,site.json,webroot/files/submissions/706a1453d6a9c4ce6b75da80ba46aedda73d3848/,9526,application/json,0,,,,,,,,,,,,,,,,,,,,,,,,,,,,,,,,,,0,,,0,,,,,,,,,,,,,,,,,,,,,,,,,,624.58758544922
16,ISC20,Presque,"Argonne National Laboratory","Argonne National Laboratory",DAOS,16,544,537.310000,108.190000,2668.570000,1544.190000,zip,,isc20,2020-07-10,"Argonne National Laboratory",7/13/20,,2019-11-15,2019-11-15,DAOS,1.1,34,RHEL,7.7,3.10.0-1062.4.3.el7.x86_64,10,12,"Intel Apache Pass 128GB DIMM",384,DIMM,100gE,1.1,7.7,10,12,NVMe-SSD,384,NVMe,100gE,1.1,7.7,,,114.580000,130.230000,112.270000,81.770000,4386.200000,4521.230000,2559.270000,924.090000,2100.110000,3730.500000,2357.160000,2969.000000,,2969.000000,,,2020.07.09-19.56.01-scr.zip,1,7/13/20,,,https://github.com/IO500/submission-data/tree/master/Argonne%20National%20Laboratory/Presque/DAOS/2020/submission-10,,,,0,,,,0,,,,0,,,,0,,0,,,,,,,,,,,,,,,,,,,,,,,,,,,,,,,,,,0,,,0,,,,,,,,,,,,,,,,,,,,,,,,,,537.30999755859
17,SC21,ASTRA,"National Research Center of Tranlational Medicine at Shanghai Ruijin Hospital",NRCTM,DAOS,10,360,511.021541,87.496411,2984.614027,0.000000,,1,sc21,4.98513563854882E+017,"LU Gang",10/29/21,,2021-08-01,,mustang,2.1.100,36,CentOS,7.9,3.10.0-1160.36.2.el7.x86_64,0,0,,,,,,,25,300,PMEM,,NVDIMM,,,,,,97.884571,102.354627,71.710894,81.574438,4896.241935,5041.119244,2179.374241,1754.731265,3456.875758,4392.239470,1561.463428,2813.659509,,2813.659509,-,-,2021.10.23-10.42.55.zip,1,11/19/21,,,https://github.com/IO500/submission-data/tree/master/National%20Research%20Center%20of%20Tranlational%20Medicine%20at%20Shanghai%20Ruijin%20Hospital/ASTRA/mustang/2021/submission-584,,,,0,,,,0,,,,0,,,,0,,0,,,,,,,,,,,,,,,,,,,,,,,,,,,,,,,,,,0,,,0,,,,,,,,,,,,,,,,,,,,,,,,,,511.02200317383
18,SC21,"QCT DevCloud","QCT DevCloud",QCT,DAOS,10,560,427.274472,102.854524,1774.967866,0.000000,,1,sc21,2.81298341357477E+017,,11/1/21,,,,QCT,1.3.106,56,CentOS,8.3,4.18.0-240,0,0,,,,,,,4,64,PMEM,512,NVDIMM,Infiniband,,,,,119.560689,178.243087,50.510865,103.969915,2606.603625,4368.152777,965.623009,821.912330,2590.701460,3196.019286,1023.352966,1286.666016,,1286.666016,-,-,2021.10.31-23.07.20.zip,1,11/19/21,,,https://github.com/IO500/submission-data/tree/master/QCT%20DevCloud/QCT%20DevCloud/QCT/2021/submission-581,,,,0,,,,0,,,,0,,,,0,,0,,,,,,,,,,,,,,,,,,,,,,,,,,,,,,,,,,0,,,0,,,,,,,,,,,,,,,,,,,,,,,,,,427.27398681641
19,ISC21,,Supermicro,Supermicro,DAOS,10,1120,415.039693,112.174143,1535.629705,,,,isc21,,,6/11/21,,,,SYS-120U-TNR,1.13.101,112,,,,,,,,,,,,4,,,,,,,,,,113.491924,163.248695,88.264742,96.820899,3785.499014,4405.937075,1720.793799,1000.790372,131.407871,2281.987628,1476.884379,,,2430.958209,,,2021.06.11-04.35.19.zip,1,,,,,,,,0,,,,0,,,,0,,,,0,,0,,,,,,,,,,,,,,,,,,,,,,,,,,,,,,,,,,0,,,0,,,,,,,,,,,,,,,,,,,,,,,,,,415.04000854492
20,ISC22,CTPAI,"China Telecom Research Institute",CTCLOUD,DAOS,10,200,187.842588,25.293626,1395.009083,,,1,,,jeanlucabez@gmail.com,5/13/22,,,,TeleHPCS,,,CentOS,7.9,3.10.0-1160.el7.x86_64,,,,,,,,,,,,,,,,,,,19.825822,27.938652,24.755795,29.849071,2178.870520,2562.528148,1009.691680,350.140787,1734.342536,2278.102029,826.061911,,,2226.199552,,,,1,,,,,e8d646eb-fb55-45c8-b3e6-0cdd84c8a28d,io500.tgz,webroot/files/submissions/81509fc95b59f01891e1e5297e3f6899fba6f083/,54219,application/x-compressed-tar,job.sh,webroot/files/submissions/81509fc95b59f01891e1e5297e3f6899fba6f083/,4483,application/x-shellscript,,,0,,site.json,webroot/files/submissions/645561d3b27d52c3336c2de29c5d12d1e41daf50/,8544,application/json,0,,,,,,,,,,,,,,,,,,,,,,,,,,,,,,,,,,0,,,0,,,,,,,,,,,,,,,,,,,,,,,,,,187.84259033203
21,ISC21,Govorun,"Joint Institute of Nuclear Research",RSC,DAOS,10,160,132.064713,20.193628,863.692659,,,,isc21,,,6/10/21,,2021-04,,RSC,1.2,16,,,,,,,,,,,,8,,,,,,,,,,37.714715,16.746869,19.741594,13.336159,1102.720950,2016.176058,741.151972,343.169370,629.058439,983.473306,714.156350,,,1239.415980,,,2021.06.07-21.09.20.zip,1,,,,,,,,0,,,,0,,,,0,,,,0,,0,,,,,,,,,,,,,,,,,,,,,,,,,,,,,,,,,,0,,,0,,,,,,,,,,,,,,,,,,,,,,,,,,132.06500244141
22,ISC22,AI400X2-II,DDN,DDN,EXAScaler,10,0,183.341566,48.266582,696.426569,,,,,,jeanlucabez@gmail.com,5/19/22,,,,AI400X2,EXA6,,RockyLinux,8.5,4.18.0-348.12.2.el8_5.x86_64,,,,,,,,,,,,,,,,,,,114.230285,163.327785,9.174545,31.707374,532.230027,1775.271983,434.186006,182.817066,342.309793,1300.876421,140.887504,,,11760.288646,,,,,,,,,e8d646eb-fb55-45c8-b3e6-0cdd84c8a28d,io500.tgz,webroot/files/submissions/22cf38971164e48b385994cdb0d8e342359381ba/,148057,application/x-compressed-tar,job.sh,webroot/files/submissions/22cf38971164e48b385994cdb0d8e342359381ba/,5000,application/x-shellscript,,,0,,site.json,webroot/files/submissions/08acd457851dafa329127f3efd9f41a1ce24d1e1/,9684,application/json,0,,,,,,,,,,,,,,,,,,,,,,,,,,,,,,,,,,0,,,0,,,,,,,,,,,,,,,,,,,,,,,,,,183.34156799316
23,SC21,,"Huawei Cloud",PDSL,Flashfs,15,1560,2016.697583,109.819859,37034.004400,0.000000,,,sc21,8.49437544233335E+017,PDSL,10/29/21,,,,Flashfs,1,104,EulerOS,"2.0 (SP9)",4.18,0,0,,,,,,,15,0,,,,,,,,,117.327938,115.220985,102.020160,105.464064,23660.761640,35048.861590,27992.117040,17215.620490,11299.343080,34554.069230,29510.926850,768438.443400,,768438.443400,-,-,2021.10.29-21.39.44.zip,1,11/19/21,,,,,,,0,,,,0,,,,0,,,,0,,0,,,,,,,,,,,,,,,,,,,,,,,,,,,,,,,,,,0,,,0,,,,,,,,,,,,,,,,,,,,,,,,,,2016.6999511719
24,SC20,NextGENIO,EPCC,"BSC & JGU",GekkoFS,10,3800,239.370000,45.790000,1251.320000,699.780000,zip,1,sc20,2020-11-23,"Ramon Nou",10/30/20,,2019-01-01,2020-10-10,GekkoFS,0.9dev,380,CentOS,,3.10.0-862.14.4.el7.x86_64,31,2,3DXPNVMeSSDv,2,NVMe,Omnipath,0.8dev,,31,2,3DXPNVMeSSD,2,NVMe,Omnipath,0.9dev,,,,73.660000,76.410000,26.840000,29.100000,1709.390000,1926.370000,1844.140000,288.530000,583.340000,1721.460000,691.370000,4942.000000,,4942.000000,,,2020-10-30-EPCCGekkoFSGekkoFS-10-380.zip,1,10/30/20,,,https://github.com/IO500/submission-data/tree/master/EPCC/NextGENIO/GekkoFS/2020/submission-455,,,,0,,,,0,,,,0,,,,0,,0,,,,,,,,,,,,,,,,,,,,,,,,,,,,,,,,,,0,,,0,,,,,,,,,,,,,,,,,,,,,,,,,,239.36999511719
25,SC20,"MOGON II","Johannes Gutenberg University Mainz","JGU (ADA-FS)& BSC (NEXTGenIO)",GekkoFS,10,240,167.640000,22.970000,1223.590000,547.750000,zip,1,sc20,2020-11-3,"Marc-AndrÃ© Vef",10/30/20,,2017-10-01,,GekkoFS,0.9dev,24,CentOS,,3.10.0-1127.8.2.el7.x86_64,224,1,"Intel SSD DC S4600 Series",,SATA,Omnipath,0.9dev,,224,1,"Intel SSD DC S4600 Series",,SATA,Omnipath,0.9dev,,,,42.320000,26.900000,17.540000,13.940000,2019.870000,1970.750000,2082.080000,426.960000,419.000000,2030.350000,377.660000,4419.000000,,4419.000000,,,2020-10-30-JohannesGutenbergUniversityMainzGekkoFSGekkoFS-10-24.zip,1,10/30/20,,,https://github.com/IO500/submission-data/tree/master/Johannes%20Gutenberg%20University%20Mainz/MOGON%20II/GekkoFS/2020/submission-457,,,,0,,,,0,,,,0,,,,0,,0,,,,,,,,,,,,,,,,,,,,,,,,,,,,,,,,,,0,,,0,,,,,,,,,,,,,,,,,,,,,,,,,,167.63999938965
26,SC20,Cygnus,"University of Tsukuba",OSS,Gfarm,10,20,16.120000,8.100000,32.090000,34.160000,zip,1,sc20,2020-11-26,"Kohei Sugihara",11/1/20,,2019-04-01,,Gfarm,2.7.17,2,CentOS,7.7.1908,3.10.0-1062.18.1.el7.x86_64,1,1,NVMe,,NVMe,InfiniBand,,,10,1,NVMe-SSD,,NVMe,InfiniBand,,,,,25.970000,21.740000,11.560000,0.660000,30.090000,40.640000,19.310000,13.190000,16.400000,39.230000,15.910000,352.000000,,352.000000,,,2020-11-01-UniversityofTsukubaGfarmGfarm-10-2.zip,1,11/1/20,,,https://github.com/IO500/submission-data/tree/master/University%20of%20Tsukuba/Cygnus/Gfarm/2020/submission-470,,,,0,,,,0,,,,0,,,,0,,0,,,,,,,,,,,,,,,,,,,,,,,,,,,,,,,,,,0,,,0,,,,,,,,,,,,,,,,,,,,,,,,,,16.120000839233
27,ISC20,NURION,"Korea Institute of Science and Technology Information (KISTI)",DDN,IME,2048,2048,282.450000,515.590000,154.740000,389.300000,zip,,isc20,2020-07-35,"JunWeon Yoon",7/13/20,,2018,,"Nurion Burst Buffer",1.4,1,CentOS,7.7,3.10.0-1062.el7.x86_64,48,768,NVMe,1.2TB,NVMe,Omnipath,,CentOS,0,0,,,,,,,,,787.720000,690.780000,740.420000,175.400000,22.620000,1667.460000,28.240000,15.670000,1320.590000,1659.240000,18.380000,489.000000,,489.000000,,,2020.07.08-23.59.24-app.zip,1,7/13/20,,https://www.vi4io.org/hpsl/2020/kor/kisti/start,https://github.com/IO500/submission-data/tree/master/Korea%20Institute%20of%20Science%20and%20Technology%20Information%20%28KISTI%29/NURION/Nurion%20Burst%20Buffer/2020/submission-19,,,,0,,,,0,,,,0,,,,0,,0,,,,,,,,,,,,,,,,,,,,,,,,,,,,,,,,,,0,,,0,,,,,,,,,,,,,,,,,,,,,,,,,,282.45001220703
28,SC20,Oakforest-PACS,JCAHPC,DDN,IME,2048,4096,253.570000,697.200000,92.220000,304.890000,zip,,sc20,2020-11-22,"Osamu Tatebe",10/30/20,,2016-12-01,,IME,1.3.2.1,2,CentOS,7.6,3.1,1,20,SAS-SSD,,SAS,Omnipath,,,25,1200,NVMe-SSD,,NVMe,Omnipath,,,,,934.700000,1237.430000,580.050000,352.200000,71.510000,196.150000,57.050000,11.610000,129.290000,127.340000,24.360000,1405.000000,,1405.000000,,,2020-10-30-JCAHPCIMEIME-2048-2.zip,1,10/30/20,,https://www.vi4io.org/hpsl/2020/jpn/jcahpc/start,https://github.com/IO500/submission-data/tree/master/JCAHPC/Oakforest-PACS/IME/2020/submission-454,,,,0,,,,0,,,,0,,,,0,,0,,,,,,,,,,,,,,,,,,,,,,,,,,,,,,,,,,0,,,0,,,,,,,,,,,,,,,,,,,,,,,,,,253.57000732422
29,ISC21,Google,"Google Cloud",DDN,Lustre,1000,5000,569.988364,282.780461,1148.900933,,,,isc21,,,6/11/21,,,,DDN-GCP-LocalSSD,,5,,,4.18.0-305.3.1.el8.x86_64,50,,SSD,,NVMe,,,,200,,SSD,,NVMe,,,,,,699.800593,1273.164627,38.783632,185.050489,1925.249725,1900.699024,904.443383,809.177119,1498.197803,1840.684722,495.688865,,,829.234818,,,2021.06.10-19.46.24.zip,1,,,,https://github.com/IO500/submission-data/tree/master/Google%20Cloud/Google/DDN-GCP-LocalSSD/2021/submission-542,,,,0,,,,0,,,,0,,,,0,,0,,,,,,,,,,,,,,,,,,,,,,,,,,,,,,,,,,0,,,0,,,,,,,,,,,,,,,,,,,,,,,,,,569.98797607422