id,release_id,information_system,information_institution,information_storage_vendor,information_filesystem_type,information_client_nodes,information_client_total_procs,io500_score,io500_bw,io500_md,io500_tot_iops,information_data,information_10_node_challenge,information_list_name,information_identifier,information_submitter,information_submission_date,information_embargo_end_date,information_storage_install_date,information_storage_refresh_date,information_filesystem_name,information_filesystem_version,information_client_procs_per_node,information_client_operating_system,information_client_operating_system_version,information_client_kernel_version,information_md_nodes,information_md_storage_devices,information_md_storage_type,information_md_volatile_memory_capacity,information_md_storage_interface,information_md_network,information_md_software_version,information_md_operating_system_version,information_ds_nodes,information_ds_storage_devices,information_ds_storage_type,information_ds_volatile_memory_capacity,information_ds_storage_interface,information_ds_network,information_ds_software_version,information_ds_operating_system_version,information_note,information_best,ior_easy_write,ior_easy_read,ior_hard_write,ior_hard_read,mdtest_easy_write,mdtest_easy_stat,mdtest_easy_delete,mdtest_hard_write,mdtest_hard_read,mdtest_hard_stat,mdtest_hard_delete,find_easy,find_hard,find_mixed,marker_score,marker_md,storage_data,include_in_io500,valid_from,valid_to,cdcl_url,repository_url,user_id,result_tar,result_tar_dir,result_tar_size,result_tar_type,job_script,job_script_dir,job_script_size,job_script_type,job_output,job_output_dir,job_output_size,job_output_type,system_information,system_information_dir,system_information_size,system_information_type,information_client_sockets,information_ds_clock,information_ds_media_secondary_count,information_ds_media_primary_vendor,information_ds_model,information_ds_media_secondary_capacity,information_md_spdk,information_md_media_secondary_vendor,information_ds_kernel_version,status_old,information_client_interconnect_vendor,information_ds_interconnect_rdma,information_ds_media_secondary_vendor,status_id,information_client_dpdk,information_md_interconnect_links,information_md_dpdk,information_ds_architecture,information_md_interconnect_vendor,information_ds_interconnect_links,information_client_interconnect_type,information_ds_cores_per_socket,information_md_media_primary_count,information_md_media_secondary_count,information_client_spdk,information_md_media_secondary_capacity,information_md_kernel_version,information_ds_interconnect_type,information_ds_interconnect_vendor,information_md_architecture,information_ds_sockets,information_md_interconnect_rdma,information_client_model,information_md_media_secondary_interface,information_client_interconnect_links,information_ds_operating_system,information_ds_spdk,information_client_cores_per_socket,information_md_interconnect_bandwidth,information_client_volatile_memory_capacity,information_client_clock,information_ds_media_secondary_interface,information_md_clock,information_ds_media_primary_count,information_client_architecture,information_client_interconnect_rdma,information_md_media_primary_type,information_md_model,information_ds_interconnect_bandwidth,information_md_operating_system,information_ds_dpdk,information_client_interconnect_bandwidth,information_ds_media_primary_interface,information_md_cores_per_socket,information_ds_media_primary_capacity,information_md_media_secondary_type,information_ds_media_secondary_type,information_md_media_primary_vendor,information_md_media_primary_interface,information_md_media_primary_capacity,information_md_interconnect_type,information_ds_media_primary_type,information_md_sockets,score
1,SC20,Cygnus,"University of Tsukuba",OSS,Gfarm,10,20,16.120000,8.100000,32.090000,34.160000,zip,1,sc20,2020-11-26,"Kohei Sugihara",11/1/20,,2019-04-01,,Gfarm,2.7.17,2,CentOS,7.7.1908,3.10.0-1062.18.1.el7.x86_64,1,1,NVMe,,NVMe,InfiniBand,,,10,1,NVMe-SSD,,NVMe,InfiniBand,,,,,25.970000,21.740000,11.560000,0.660000,30.090000,40.640000,19.310000,13.190000,16.400000,39.230000,15.910000,352.000000,,352.000000,,,2020-11-01-UniversityofTsukubaGfarmGfarm-10-2.zip,1,11/1/20,,,https://github.com/IO500/submission-data/tree/master/University%20of%20Tsukuba/Cygnus/Gfarm/2020/submission-470,,,,0,,,,0,,,,0,,,,0,,0,,,,,,,,,,,,,,,,,,,,,,,,,,,,,,,,,,0,,,0,,,,,,,,,,,,,,,,,,,,,,,,,,16.12
2,SC20,"Archer 2 (test system)",EPCC,Cray,Lustre,10,80,10.680000,2.630000,43.430000,28.720000,zip,1,sc20,2020-11-6,"Julian Kunkel",10/30/20,,2020-10-10,,Work,2.12,8,SUSE,15.1,4.12.14-197.51_9.1.42-cray_shasta_c,2,0,,,,,,,12,0,HDD,,,,,,,,33.060000,11.920000,0.110000,1.140000,44.540000,125.160000,34.790000,21.210000,56.740000,129.940000,13.100000,32.000000,,32.000000,,,2020-10-30-EPCCWorkLustre-10-8.zip,1,10/30/20,,,https://github.com/IO500/submission-data/tree/master/EPCC/Archer%202%20%28test%20system%29/Work/2020/submission-472,,,,0,,,,0,,,,0,,,,0,,0,,,,,,,,,,,,,,,,,,,,,,,,,,,,,,,,,,0,,,0,,,,,,,,,,,,,,,,,,,,,,,,,,10.68
3,SC19,HAL,CNES,DDN,"Spectrum Scale",96,96,37.160000,9.710000,142.200000,97.900000,zip,,sc19,2019-11-5,"Florent  Ventimiglia & Guillaume Eynard-Bontemps",11/8/19,,2017-01-01,2019-09-24,/work,4.2.3-18,1,CentOS,7.6.1810,3.10.0-957.12.2.el7.x86_64,2,12,NVMe,192GB,NVMe,"IB EDR",4.2.3-18,7.6.1810,4,300,SSD,192GB,SAS,"IB EDR",4.2.3-18,7.6.1810,,,62.640000,72.330000,0.090000,20.860000,144.070000,277.730000,111.900000,18.270000,108.140000,234.030000,28.980000,2786.000000,,2786.000000,,,2019-11-08-CNESworkSpectrumScale-96-1.zip,1,11/8/19,,https://www.vi4io.org/hpsl/2020/fra/CNES/start,https://github.com/IO500/submission-data/tree/master/CNES/HAL//work/2019/submission-101,,,,0,,,,0,,,,0,,,,0,,0,,,,,,,,,,,,,,,,,,,,,,,,,,,,,,,,,,0,,,0,,,,,,,,,,,,,,,,,,,,,,,,,,37.16
4,ISC20,HAL,"National Center for Supercomputing Applications",DDN,"Spectrum Scale",10,100,11.310000,3.620000,35.370000,27.860000,zip,1,isc20,2020-07-26,"National Center for Supercomputing Applications",7/13/20,,09/2019,,HAL,5.0.5.0,10,CentOS,7.7,4.18.0-147.0.3.el7.ppc64le,8,2,NVMe,32,Infiniband,Infiniband,5.0.5.0,7.6,8,2,NVMe,32,Infiniband,Infiniband,5.0.5.0,7.6,,,14.860000,12.740000,0.430000,2.100000,71.460000,105.830000,33.260000,2.390000,65.370000,104.910000,0.460000,1300.000000,,1300.000000,,,2020.06.27-06.53.38-scr.zip,1,7/13/20,,,https://github.com/IO500/submission-data/tree/master/National%20Center%20for%20Supercomputing%20Applications/HAL/HAL/2020/submission-157,,,,0,,,,0,,,,0,,,,0,,0,,,,,,,,,,,,,,,,,,,,,,,,,,,,,,,,,,0,,,0,,,,,,,,,,,,,,,,,,,,,,,,,,11.31
5,SC19,"Palmetto Burstbuffer","Clemson University",AdvancedHPC,BeeGFS,10,120,21.550000,12.970000,35.800000,42.990000,zip,1,sc19,2019-11-34,"Clemson University ACI",11/1/19,,2019-05-01,,burstbuffer,7.1.3,12,"Oracle Linux",7.6,4.1.12-103.9.4.el7uek.x86_64,4,2,NVMe,512GB,NVMe,EDR,7.1.3,7.7,4,24,NVMe,512GB,NVMe,EDR,7.1.3,7.7,,,20.870000,29.590000,3.510000,13.060000,34.390000,190.590000,48.810000,3.910000,15.520000,55.580000,2.610000,957.000000,,957.000000,,,2019-11-01-ClemsonUniversityburstbufferBeeGFS-10-12.zip,1,11/1/19,,,https://github.com/IO500/submission-data/tree/master/Clemson%20University/Palmetto%20Burstbuffer/burstbuffer/2019/submission-124,,,,0,,,,0,,,,0,,,,0,,0,,,,,,,,,,,,,,,,,,,,,,,,,,,,,,,,,,0,,,0,,,,,,,,,,,,,,,,,,,,,,,,,,21.55
6,SC19,TigerShark,SUSE,"SUSE, Intel, Lenovo","SUSE Enterprise Storage - CephFS",15,120,14.910000,5.740000,38.720000,34.510000,zip,,sc19,2019-11-40,"David Byte",11/7/19,,2018-11-01,2019-10-01,,"6 (14.2.4)",8,"SUSE Linux Enterprise","15 SP1",4.12.14-197.21-default,15,1,NVME,32GB,NVMe,"100Gb Ethernet","6 (14.2.4)","15 SP1",10,119,SSD,96GB,SATA,"100Gb Ethernet","6 (14.2.4)","15 SP1",,,16.070000,9.140000,1.570000,4.700000,32.820000,127.920000,20.840000,12.920000,41.640000,68.790000,6.220000,251.000000,,251.000000,,,2019-11-07-SUSESUSEEnterpriseStorage-CephFS-15-8.zip,1,11/7/19,,,,,,,0,,,,0,,,,0,,,,0,,0,,,,,,,,,,,,,,,,,,,,,,,,,,,,,,,,,,0,,,0,,,,,,,,,,,,,,,,,,,,,,,,,,14.91
7,SC19,Sherlock/Regal,Stanford,Dell,Lustre,10,160,7.050000,1.640000,30.280000,19.300000,zip,1,sc19,2019-11-29,"Stanford Research Computing Center",11/8/19,,2013-05-28,2016-08-05,Sherlock/Regal,2.8.0,16,CentOS,7.6,3.10.0-957.27.2.el7.x86_64,1,1,HDD,128GB,SAS,Infiniband,2.8.0,6.7,18,108,NL-SAS7.2K,128GB,SAS,Infiniband,2.8.0,6.7,,,3.660000,6.680000,0.420000,0.710000,13.110000,129.690000,12.340000,11.730000,19.320000,41.740000,7.740000,460.000000,,460.000000,,,2019-11-08-StanfordSherlockRegalLustre-10-16.zip,1,11/8/19,,,https://github.com/IO500/submission-data/tree/master/Stanford/Sherlock/Regal/Sherlock/Regal/2019/submission-184,,,,0,,,,0,,,,0,,,,0,,0,,,,,,,,,,,,,,,,,,,,,,,,,,,,,,,,,,0,,,0,,,,,,,,,,,,,,,,,,,,,,,,,,7.05
8,SC20,"MOGON II","Johannes Gutenberg University Mainz","JGU (ADA-FS)& BSC (NEXTGenIO)",GekkoFS,10,240,167.640000,22.970000,1223.590000,547.750000,zip,1,sc20,2020-11-3,"Marc-AndrÃ© Vef",10/30/20,,2017-10-01,,GekkoFS,0.9dev,24,CentOS,,3.10.0-1127.8.2.el7.x86_64,224,1,"Intel SSD DC S4600 Series",,SATA,Omnipath,0.9dev,,224,1,"Intel SSD DC S4600 Series",,SATA,Omnipath,0.9dev,,,,42.320000,26.900000,17.540000,13.940000,2019.870000,1970.750000,2082.080000,426.960000,419.000000,2030.350000,377.660000,4419.000000,,4419.000000,,,2020-10-30-JohannesGutenbergUniversityMainzGekkoFSGekkoFS-10-24.zip,1,10/30/20,,,https://github.com/IO500/submission-data/tree/master/Johannes%20Gutenberg%20University%20Mainz/MOGON%20II/GekkoFS/2020/submission-457,,,,0,,,,0,,,,0,,,,0,,0,,,,,,,,,,,,,,,,,,,,,,,,,,,,,,,,,,0,,,0,,,,,,,,,,,,,,,,,,,,,,,,,,167.64
9,SC19,AI400,DDN,DDN,Lustre,10,240,63.880000,19.650000,207.630000,159.380000,zip,1,sc19,2019-11-7,"Shuichi Ihara",11/10/19,,,,AI400,2.12.58,24,CentOS,8.0,4.18.0-80.el8.x86_64,2,0,SSD,64GB,NVMe,Infiniband,2.12.58,CentOS7.6,2,12,SSD,64GB,NVMe,Infiniband,2.12.58,CentOS7.6,,,28.620000,41.720000,2.960000,42.190000,152.840000,451.970000,132.760000,79.650000,172.590000,449.930000,75.150000,810.000000,,810.000000,,,2019-11-10-DDNAI400Lustre-10-24.zip,1,11/10/19,,,https://github.com/IO500/submission-data/tree/master/DDN/AI400/AI400/2019/submission-75,,,,0,,,,0,,,,0,,,,0,,0,,,,,,,,,,,,,,,,,,,,,,,,,,,,,,,,,,0,,,0,,,,,,,,,,,,,,,,,,,,,,,,,,63.88
10,SC19,"bracewell scratch2",CSIRO,Dell/ThinkParQ,beegfs,26,260,94.860000,69.100000,130.230000,177.590000,zip,,sc19,2019-11-4,"CSIRO IM&T",11/12/19,,,,scratch2,7.1.3,10,SUSE,"SLES 12 SP4",4.12,2,24,NVMe,384GB,NVMe,"IB EDR",7.1.3,"SLES 12 SP4",12,24,NVMe,192GB,NVMe,"IB EDR",7.1.3,"SLES 12 SP4",,,228.980000,180.440000,5.430000,101.640000,143.570000,882.770000,231.880000,10.950000,36.150000,139.090000,17.560000,2911.000000,,2911.000000,,,2019-11-12-CSIROscratch2beegfs-26-10.zip,1,11/12/19,,,https://github.com/IO500/submission-data/tree/master/CSIRO/bracewell%20scratch2/scratch2/2019/submission-52,,,,0,,,,0,,,,0,,,,0,,0,,,,,,,,,,,,,,,,,,,,,,,,,,,,,,,,,,0,,,0,,,,,,,,,,,,,,,,,,,,,,,,,,94.86
11,ISC20,Cedar,"Simon Fraser University",Dell/Seagate,Lustre,288,288,18.720000,7.660000,45.750000,42.480000,zip,,isc20,2020-07-28,"Simon Fraser University",7/13/20,,2017-06-01,,project,2.12.4,1,CentOS,7.7,3.10.0-1062.12.1.el7.x86_64,2,1,SSD,128GB,SAS,Omni-Path,2.12.4,"CentOS 7.7",12,48,NL-SAS7.2K,128GB,SAS,Omni-Path,2.12.4,"CentOS 7.7",,,31.820000,40.180000,0.510000,5.250000,13.800000,90.030000,31.760000,14.390000,30.370000,43.650000,29.410000,867.000000,,867.000000,,,2020.03.22-21.26.02.zip,1,7/13/20,,,https://github.com/IO500/submission-data/tree/master/Simon%20Fraser%20University/Cedar/project/2020/submission-129,,,,0,,,,0,,,,0,,,,0,,0,,,,,,,,,,,,,,,,,,,,,,,,,,,,,,,,,,0,,,0,,,,,,,,,,,,,,,,,,,,,,,,,,18.72
12,SC19,TStor3000,"State Key Laboratory of High-end Server & Storage Technology (HSS)",INSPUR,BeeGFS,10,300,82.570000,41.140000,165.710000,175.430000,zip,1,sc19,2019-11-14,,11/7/19,,2019-10-10,2019-11-01,beegfs,7.1.3,30,Linux,CentOS7.6,3.10.0-957.el7.x86_64,24,3,AEP,384GB,AEP,EDR,7.1.3,CentOS7.6,24,192,NVME,384GB,NVME,EDR,7.1.3,CentOS7.6,,,105.100000,97.260000,6.430000,43.560000,478.030000,2621.060000,762.010000,8.470000,26.920000,121.680000,11.870000,1810.000000,,1810.000000,,,2019-11-07-StateKeyLaboratoryofHigh-endServerStorageTechnologyHSSbeegfsBeeGFS-10-30.zip,1,11/7/19,,,https://github.com/IO500/submission-data/tree/master/State%20Key%20Laboratory%20of%20High-end%20Server%20%26%20Storage%20Technology%20%28HSS%29/TStor3000/beegfs/2019/submission-58,,,,0,,,,0,,,,0,,,,0,,0,,,,,,,,,,,,,,,,,,,,,,,,,,,,,,,,,,0,,,0,,,,,,,,,,,,,,,,,,,,,,,,,,82.57
13,ISC20,EC2-10xi3en.metal,"Red Hat","Red Hat",CephFS,10,320,57.170000,26.290000,124.300000,124.750000,zip,1,isc20,2020-07-41,"Red Hat",7/13/20,,2020-07-05,,,"Master (e9cc7d86)",32,Fedora,31,5.7.6-201.fc32.x86_64,10,8,NVMe,768GB,NVMe,100GbE,,"Fedora 31",10,8,NVMe,768GB,,,,"Fedora 31",,,36.260000,75.620000,9.140000,19.080000,191.980000,903.110000,123.450000,17.190000,87.510000,97.400000,18.810000,966.000000,,966.000000,,,2020.07.07-20.27.19-scr.zip,1,7/13/20,,,,,,,0,,,,0,,,,0,,,,0,,0,,,,,,,,,,,,,,,,,,,,,,,,,,,,,,,,,,0,,,0,,,,,,,,,,,,,,,,,,,,,,,,,,57.17
14,SC19,Penguin-ASG-NVBeeOne,"Penguin Computing Benchmarking and Innovation Lab","Penguin Computing/Excelero",BeeGFS,10,320,39.650000,17.710000,88.760000,87.370000,zip,1,sc19,2019-11-18,"Kevin Tubbs",11/12/19,2019-11-11,2019-08-12,2019-08-12,BeeGFS-NVMesh,7.1.3,32,RHEL,7.6,3.10.0-957.27.2.el7.x86_64,8,4,NVMe,,EDR,EDR,7.1.3,"RHEL 7.6",8,72,NVMe,,NVMe,EDR,7.1.3,"RHEL 7.6",,,30.960000,57.520000,1.760000,31.460000,156.840000,1681.390000,120.220000,7.850000,25.480000,107.330000,7.330000,772.000000,,772.000000,,,2019-11-12-PenguinComputingBenchmarkingandInnovationLabBeeGFS-NVMeshBeeGFS-10-32.zip,1,11/12/19,,,https://github.com/IO500/submission-data/tree/master/Penguin%20Computing%20Benchmarking%20and%20Innovation%20Lab/Penguin-ASG-NVBeeOne/BeeGFS-NVMesh/2019/submission-98,,,,0,,,,0,,,,0,,,,0,,0,,,,,,,,,,,,,,,,,,,,,,,,,,,,,,,,,,0,,,0,,,,,,,,,,,,,,,,,,,,,,,,,,39.65
15,SC20,"JASMIN 4","The Science and Technology Facilities Council","Quobyte Inc.",Quobyte,48,336,17.550000,19.760000,15.600000,28.430000,zip,,sc20,2020-11-18,"The Science and Technology Facilities Council. UK",10/30/20,,2018-04-15,,"JASMIN 4",2.26,7,CentOS,7.8.2003,3.10.0-1127.10.1.el7.x86_64,0,0,,,,,,,87,4546,"each host: 1x SASSATA SDD (metadata); 44x SAS-NL (data); 1x SAS-SSD (data; 47 hosts only)",64GiB,SAS,Ethernet,"Quobyte 2.26","RHEL 7.5",,,120.950000,114.780000,3.100000,3.540000,4.640000,56.540000,10.700000,2.870000,7.840000,47.410000,8.190000,143.000000,,143.000000,,,2020-10-30-TheScienceandTechnologyFacilitiesCouncilJASMIN4Quobyte-48-7.zip,1,10/30/20,,https://www.vi4io.org/hpsl/2020/gbr/ral/start,https://github.com/IO500/submission-data/tree/master/The%20Science%20and%20Technology%20Facilities%20Council/JASMIN%204/JASMIN%204/2020/submission-469,,,,0,,,,0,,,,0,,,,0,,0,,,,,,,,,,,,,,,,,,,,,,,,,,,,,,,,,,0,,,0,,,,,,,,,,,,,,,,,,,,,,,,,,17.55
16,SC19,"DGX-2H SuperPOD",NVIDIA,DDN,Lustre,10,400,249.500000,86.970000,715.760000,597.160000,zip,1,sc19,2019-11-1,NVIDIA,11/12/19,111919,11/05,110519,Exascaler,5,40,"NVIDIA DGX-OS",4.02,4.15.0-50-generic,10,2,NVMe,1.92TB,"Mellanox EDR InfiniBand","Mellanox EDR InfiniBand",Exascaler,Exa5.0,10,21,NVMe,1.92TB,"Mellanox EDR InfiniBand","Mellanox EDR InfiniBand",Exascaler,Exa5.0,,,273.160000,286.170000,11.160000,65.590000,799.580000,2000.810000,485.870000,446.270000,472.520000,881.030000,584.580000,816.000000,,816.000000,,,2019-11-12-NVIDIAExascalerLustre-10-40.zip,1,11/12/19,,,https://github.com/IO500/submission-data/tree/master/NVIDIA/DGX-2H%20SuperPOD/Exascaler/2019/submission-22,,,,0,,,,0,,,,0,,,,0,,0,,,,,,,,,,,,,,,,,,,,,,,,,,,,,,,,,,0,,,0,,,,,,,,,,,,,,,,,,,,,,,,,,249.5
17,ISC20,bracewell,CSIRO,Dell/DDN,Lustre,10,400,99.640000,39.900000,248.810000,227.700000,zip,1,isc20,2020-07-14,CSIRO,7/13/20,,2018-08-08,,scratch2,2.12.3,40,CentOS,7.7,3.10,8,4,NVMe,192,NVMe,IB-EDR,2.12.3,7.7,8,20,NVMe,192,NVMe,IB-EDR,2.12.3,7.7,,,135.030000,133.620000,10.440000,13.460000,206.330000,485.450000,186.400000,150.710000,208.810000,378.140000,124.150000,532.000000,,532.000000,,,2020.07.14-13.32.08-scr.zip,1,7/13/20,,https://www.vi4io.org/hpsl/2020/aus/CSIRO/start,https://github.com/IO500/submission-data/tree/master/CSIRO/bracewell/scratch2/2020/submission-47,,,,0,,,,0,,,,0,,,,0,,0,,,,,,,,,,,,,,,,,,,,,,,,,,,,,,,,,,0,,,0,,,,,,,,,,,,,,,,,,,,,,,,,,99.64
18,SC19,"Oracle Cloud Infrastructure with Block Volume Service running Spectrum Scale ","Oracle Cloud Infrastructure","Oracle Cloud Infrastructure Block Volumes Service","Spectrum Scale",30,480,47.550000,20.380000,110.930000,106.230000,zip,,sc19,2019-11-42,"Pinkesh Valdria",10/3/19,,,,"Spectrum Scale",5.0.3.2,16,"CentOS Linux","CentOS Linux release 7.6.1810 (Core)  ",3.10.0-957.27.2.el7.x86_64,22,11,"NVMe SSD","768 GB"," iSCSI  (network attached)","25Gbps Ethernet","IBM Spectrum Scale 5.0.3.2","CentOS Linux release 7.6.1810 (Core) with Kernel (3.10.0-957.27.2.el7.x86_64)",22,11,"NVMe SSD","768 GB"," iSCSI  (network attached)","25Gbps Ethernet","IBM Spectrum Scale 5.0.3.2","CentOS Linux release 7.6.1810 (Core) with Kernel (3.10.0-957.27.2.el7.x86_64)",,,36.380000,53.590000,3.610000,24.550000,430.840000,604.520000,341.630000,17.930000,31.540000,30.860000,8.720000,1692.000000,,1692.000000,,,2019-10-03-OracleCloudInfrastructureSpectrumScaleSpectrumScale-30-16.zip,1,10/3/19,,,https://github.com/IO500/submission-data/tree/master/Oracle%20Cloud%20Infrastructure/Oracle%20Cloud%20Infrastructure%20with%20Block%20Volume%20Service%20running%20Spectrum%20Scale%20/Spectrum%20Scale/2019/submission-90,,,,0,,,,0,,,,0,,,,0,,0,,,,,,,,,,,,,,,,,,,,,,,,,,,,,,,,,,0,,,0,,,,,,,,,,,,,,,,,,,,,,,,,,47.55
19,ISC20,Presque,"Argonne National Laboratory","Argonne National Laboratory",DAOS,16,544,537.310000,108.190000,2668.570000,1544.190000,zip,,isc20,2020-07-10,"Argonne National Laboratory",7/13/20,,2019-11-15,2019-11-15,DAOS,1.1,34,RHEL,7.7,3.10.0-1062.4.3.el7.x86_64,10,12,"Intel Apache Pass 128GB DIMM",384,DIMM,100gE,1.1,7.7,10,12,NVMe-SSD,384,NVMe,100gE,1.1,7.7,,,114.580000,130.230000,112.270000,81.770000,4386.200000,4521.230000,2559.270000,924.090000,2100.110000,3730.500000,2357.160000,2969.000000,,2969.000000,,,2020.07.09-19.56.01-scr.zip,1,7/13/20,,,https://github.com/IO500/submission-data/tree/master/Argonne%20National%20Laboratory/Presque/DAOS/2020/submission-10,,,,0,,,,0,,,,0,,,,0,,0,,,,,,,,,,,,,,,,,,,,,,,,,,,,,,,,,,0,,,0,,,,,,,,,,,,,,,,,,,,,,,,,,537.31
20,SC20,Endeavour,Intel,Intel,DAOS,10,640,353.720000,43.590000,2870.640000,1197.350000,zip,1,sc20,2020-11-24,"Mohamad Chaarawi",10/30/20,,2020-10-27,,DAOS,1.1.1,64,Centos,8.2,4.18.0,0,0,,,,,,,33,8,"SSD + PMEM",195GB,"SPDK. PMDK",Infiniband,1.1.1,7.8,,,53.370000,43.340000,40.840000,38.200000,5702.330000,5600.550000,3463.990000,1253.010000,1660.420000,2706.870000,2727.030000,2714.000000,,2714.000000,,,2020-10-30-IntelDAOSDAOS-10-64.zip,1,10/30/20,,,https://github.com/IO500/submission-data/tree/master/Intel/Endeavour/DAOS/2020/submission-453,,,,0,,,,0,,,,0,,,,0,,0,,,,,,,,,,,,,,,,,,,,,,,,,,,,,,,,,,0,,,0,,,,,,,,,,,,,,,,,,,,,,,,,,353.72
21,SC19,dm11,"Janelia Research Campus, HHMI",#N/A,"Scale-out NAS",10,760,6.420000,2.610000,15.820000,14.610000,zip,1,sc19,2019-11-43,"Janelia Scientific Computing Systems",11/10/19,,32018,,#N/A,8.1.2,76,Scientific-Linux,7.6,3.10.0-957.10.1.el7.x86_64,12,180,NAND,256GB,SAS,40GbE,8.1.2,7.6,56,840,HDD,128GB,SATA,40GbE,8.1.2,7.6,,,16.130000,13.390000,0.040000,5.950000,102.150000,290.650000,12.640000,0.990000,18.050000,13.610000,0.350000,123.000000,,123.000000,,,2019-11-10-JaneliaResearchCampusHowardHughesMedicalInstituteScale-outNAS-10-76.zip,1,11/10/19,,,https://github.com/IO500/submission-data/tree/master/Janelia%20Research%20Campus%2C%20HHMI/dm11/%23N/A/2019/submission-188,,,,0,,,,0,,,,0,,,,0,,0,,,,,,,,,,,,,,,,,,,,,,,,,,,,,,,,,,0,,,0,,,,,,,,,,,,,,,,,,,,,,,,,,6.42
22,SC19,nrs,"Janelia Research Campus, HHMI",Qumulo,"Scale-out NAS",10,760,4.190000,2.880000,6.110000,8.010000,zip,1,sc19,2019-11-36,"Janelia Scientific Computing Systems",11/10/19,,92016,,"Qumulo FS",2.14.0.1,76,Scientific-Linux,7.6,3.10.0-957.10.1.el7.x86_64,0,13,SSD,,SATA,,,,20,520,HDD,128GB,SATA,40GbE,2.14.0.1,7.6,,,5.440000,13.370000,0.170000,5.710000,9.030000,171.200000,10.770000,0.210000,9.810000,9.070000,0.180000,35.000000,,35.000000,,,2019-11-10-JaneliaResearchCampusHowardHughesMedicalInstituteQumuloFSScale-outNAS-10-76.zip,1,11/10/19,,,https://github.com/IO500/submission-data/tree/master/Janelia%20Research%20Campus%2C%20HHMI/nrs/Qumulo%20FS/2019/submission-206,,,,0,,,,0,,,,0,,,,0,,0,,,,,,,,,,,,,,,,,,,,,,,,,,,,,,,,,,0,,,0,,,,,,,,,,,,,,,,,,,,,,,,,,4.19
23,SC19,nearline4,"Janelia Research Campus, HHMI",Qumulo,"Scale-out NAS",10,760,3.670000,2.450000,5.490000,7.070000,zip,1,sc19,2019-11-24,"Janelia Scientific Computing Systems",11/10/19,,112018,,"Qumulo FS",2.14.0.1,76,Scientific-Linux,7.6,3.10.0-957.10.1.el7.x86_64,0,3,SSD,,SATA,,,,40,480,HDD,64GB,SATA,10GbE,2.14.0.1,7.6,,,6.710000,8.320000,0.130000,4.990000,8.170000,147.780000,5.640000,0.180000,11.880000,10.280000,0.180000,31.000000,,31.000000,,,2019-11-10-JaneliaResearchCampusHowardHughesMedicalInstituteQumuloFSScale-outNAS-10-76.zip,1,11/10/19,,,https://github.com/IO500/submission-data/tree/master/Janelia%20Research%20Campus%2C%20HHMI/nearline4/Qumulo%20FS/2019/submission-208,,,,0,,,,0,,,,0,,,,0,,0,,,,,,,,,,,,,,,,,,,,,,,,,,,,,,,,,,0,,,0,,,,,,,,,,,,,,,,,,,,,,,,,,3.67
24,ISC20,"SpectrumScale on Oracle Cloud","Oracle Cloud Infrastructure","Oracle Cloud Infrastructure","Spectrum Scale",48,768,70.910000,34.910000,144.060000,151.280000,zip,,isc20,2020-07-25,"PINKESH VALDRIA",7/13/20,,2020-06-07,2020-06-07,OCI-SpectrumScale,5.0.5.0,16,CentOS,7.8,3.10.0-1127.10.1.el7.x86_64,40,10,NVMe,"768 GB",iSCSI,Ethernet,5.0.5.0,CentOS78,40,10,NVMe,"768 GB",iSCSI,Ethernet,5.0.5.0,CentOS78,,,83.340000,93.460000,4.730000,40.290000,986.280000,796.960000,408.900000,18.900000,28.140000,48.680000,10.080000,2212.000000,,2212.000000,,,2020.07.09-15.51.08-app.zip,1,7/13/20,,,https://github.com/IO500/submission-data/tree/master/Oracle%20Cloud%20Infrastructure/SpectrumScale%20on%20Oracle%20Cloud/OCI-SpectrumScale/2020/submission-64,,,,0,,,,0,,,,0,,,,0,,0,,,,,,,,,,,,,,,,,,,,,,,,,,,,,,,,,,0,,,0,,,,,,,,,,,,,,,,,,,,,,,,,,70.91
25,ISC20,Govorun,JINR,"RSC Group",Lustre,50,800,90.870000,35.610000,231.880000,209.160000,zip,,isc20,2020-07-36,p.lavrenko@rsc-tech.ru,7/13/20,,03/2018,10/2019,"RSC Storage on demand JINR",2.13.0,16,CentOS,7.7.1908,3.10.0-1062.1.1.el7.x86_64,12,2,NVMe,187GB,"NVMe over Fabric",OPA,2.13.0,7.7.1908,12,2,NVMe,187GB,"NVMe over Fabric",OPA,2.13.0,7.7.1908,,,156.460000,78.780000,11.670000,11.180000,492.380000,858.770000,348.720000,113.770000,164.740000,201.260000,67.450000,223.000000,,223.000000,,,2020.07.06-20.43.13-scr.zip,1,7/13/20,,https://www.vi4io.org/hpsl/2020/rus/JINR/start,https://github.com/IO500/submission-data/tree/master/JINR/Govorun/RSC%20Storage%20on%20demand%20JINR/2020/submission-55,,,,0,,,,0,,,,0,,,,0,,0,,,,,,,,,,,,,,,,,,,,,,,,,,,,,,,,,,0,,,0,,,,,,,,,,,,,,,,,,,,,,,,,,90.87
26,SC20,MVS10POP2,"Joint Supercomputer Center of the Russian Academy of Sciences","RSC Group",Lustre,54,864,125.500000,45.310000,347.610000,296.880000,zip,,sc20,2020-11-8,"RSC Group",10/30/20,,2020-10-26,2020-10-26,iojscc,2.13,16,CentOS,7.7.1908,3.10.0-1062.1.1.el7.x86_64,50,1,SSD,187GB,NVMe,Omnipath,2.13,7.7.1908,50,1,SSD-NVMe,187G,NVMe,Omnipath,2.13,7.7.1908,,,98.300000,122.730000,19.940000,17.520000,319.520000,2171.380000,526.140000,62.720000,250.470000,348.520000,59.040000,1807.000000,,1807.000000,,,2020-10-30-JointSupercomputerCenteroftheRussianAcademyofSciencesiojsccLustre-54-16.zip,1,10/30/20,,https://www.vi4io.org/hpsl/2020/rus/jsccras/start,https://github.com/IO500/submission-data/tree/master/Joint%20Supercomputer%20Center%20of%20the%20Russian%20Academy%20of%20Sciences/MVS10POP2/iojscc/2020/submission-460,,,,0,,,,0,,,,0,,,,0,,0,,,,,,,,,,,,,,,,,,,,,,,,,,,,,,,,,,0,,,0,,,,,,,,,,,,,,,,,,,,,,,,,,125.5