id,release_id,information_system,information_institution,information_storage_vendor,information_filesystem_type,information_client_nodes,information_client_total_procs,io500_score,io500_bw,io500_md,io500_tot_iops,information_data,information_10_node_challenge,information_list_name,information_identifier,information_submitter,information_submission_date,information_embargo_end_date,information_storage_install_date,information_storage_refresh_date,information_filesystem_name,information_filesystem_version,information_client_procs_per_node,information_client_operating_system,information_client_operating_system_version,information_client_kernel_version,information_md_nodes,information_md_storage_devices,information_md_storage_type,information_md_volatile_memory_capacity,information_md_storage_interface,information_md_network,information_md_software_version,information_md_operating_system_version,information_ds_nodes,information_ds_storage_devices,information_ds_storage_type,information_ds_volatile_memory_capacity,information_ds_storage_interface,information_ds_network,information_ds_software_version,information_ds_operating_system_version,information_note,information_best,ior_easy_write,ior_easy_read,ior_hard_write,ior_hard_read,mdtest_easy_write,mdtest_easy_stat,mdtest_easy_delete,mdtest_hard_write,mdtest_hard_read,mdtest_hard_stat,mdtest_hard_delete,find_easy,find_hard,find_mixed,marker_score,marker_md,storage_data,include_in_io500,valid_from,valid_to,cdcl_url,repository_url,user_id,result_tar,result_tar_dir,result_tar_size,result_tar_type,job_script,job_script_dir,job_script_size,job_script_type,job_output,job_output_dir,job_output_size,job_output_type,system_information,system_information_dir,system_information_size,system_information_type,information_client_sockets,information_ds_clock,information_ds_media_secondary_count,information_ds_media_primary_vendor,information_ds_model,information_ds_media_secondary_capacity,information_md_spdk,information_md_media_secondary_vendor,information_ds_kernel_version,status_old,information_client_interconnect_vendor,information_ds_interconnect_rdma,information_ds_media_secondary_vendor,status_id,information_client_dpdk,information_md_interconnect_links,information_md_dpdk,information_ds_architecture,information_md_interconnect_vendor,information_ds_interconnect_links,information_client_interconnect_type,information_ds_cores_per_socket,information_md_media_primary_count,information_md_media_secondary_count,information_client_spdk,information_md_media_secondary_capacity,information_md_kernel_version,information_ds_interconnect_type,information_ds_interconnect_vendor,information_md_architecture,information_ds_sockets,information_md_interconnect_rdma,information_client_model,information_md_media_secondary_interface,information_client_interconnect_links,information_ds_operating_system,information_ds_spdk,information_client_cores_per_socket,information_md_interconnect_bandwidth,information_client_volatile_memory_capacity,information_client_clock,information_ds_media_secondary_interface,information_md_clock,information_ds_media_primary_count,information_client_architecture,information_client_interconnect_rdma,information_md_media_primary_type,information_md_model,information_ds_interconnect_bandwidth,information_md_operating_system,information_ds_dpdk,information_client_interconnect_bandwidth,information_ds_media_primary_interface,information_md_cores_per_socket,information_ds_media_primary_capacity,information_md_media_secondary_type,information_ds_media_secondary_type,information_md_media_primary_vendor,information_md_media_primary_interface,information_md_media_primary_capacity,information_md_interconnect_type,information_ds_media_primary_type,information_md_sockets,score
1,SC20,ThunderX2,"University of Reading",,"Local file system",1,16,6.230000,0.370000,104.540000,26.880000,zip,,sc20,2020-11-1,"Julian Kunkel",10/30/20,,2019-03-22,,Ext4,,16,Ubuntu,20.04,5.4.0-52-generic,0,0,,,,,,,0,0,,,,,,,,,0.360000,0.410000,0.360000,0.360000,46.930000,468.710000,33.710000,17.420000,33.660000,409.020000,28.640000,2801.000000,,2801.000000,,,2020-10-30-UniversityofReadingExt4Localfilesystem-1-16.zip,1,10/30/20,,,https://github.com/IO500/submission-data/tree/master/University%20of%20Reading/ThunderX2/Ext4/2020/submission-474,,,,0,,,,0,,,,0,,,,0,,0,,,,,,,,,,,,,,,,,,,,,,,,,,,,,,,,,,0,,,0,,,,,,,,,,,,,,,,,,,,,,,,,,6.2300000190735
2,SC21,Sandbox,IBMDL,IBM,SpectrumScale,10,0,3.170080,0.607754,16.565892,0.000000,,1,sc21,5.75918964637274E+017,"Robert Tracey",11/1/21,,,,GPFS,,,,,,0,0,,,,,,,0,0,,,,,,,,,1.831022,2.020913,0.113321,0.325357,13.668734,30.999401,11.902744,3.597200,14.349057,19.981029,4.308941,0.000000,,0.000000,-,-,2021.10.08-10.42.34.zip,1,11/19/21,,,https://github.com/IO500/submission-data/tree/master/IBMDL/Sandbox/GPFS/2021/submission-586,,,,0,,,,0,,,,0,,,,0,,0,,,,,,,,,,,,,,,,,,,,,,,,,,,,,,,,,,0,,,0,,,,,,,,,,,,,,,,,,,,,,,,,,3.1700799465179
3,ISC21,Mistral,DKRZ,Seagate/Cray,Lustre,10,80,5.219629,1.159355,23.499735,,,,isc21,,,6/4/21,,,,Lustre02,,8,,,2.6.32-754.33.1.el6.x86_64,4,,,,,,,,147,,,,,,,,,,20.560488,25.056288,0.042972,0.081607,13.679607,89.850219,16.824885,9.330521,1.623404,62.669171,9.914240,,,477.873593,,,2021.06.04-18.25.22.zip,1,,,,https://github.com/IO500/submission-data/tree/master/DKRZ/Mistral/Lustre02/2021/submission-539,,,,0,,,,0,,,,0,,,,0,,0,,,,,,,,,,,,,,,,,,,,,,,,,,,,,,,,,,0,,,0,,,,,,,,,,,,,,,,,,,,,,,,,,5.2196297645569
4,SC19,"IST Austria HPC","IST Austria",Homemade@IST,BeeGFS,10,100,6.630000,1.390000,31.620000,18.800000,zip,1,sc19,2019-11-13,"Janos Kiss",11/8/19,,2019-09-02,,BeeGFS,7.1.3,10,Debian,"Debian 9 (stretch)",4.9.0-9-amd64,2,2,"NVMe Samsung PM1725A 6.4TB",128GB,NVMe,IB-EDR,"EXT4, BeeGFS 7.1.3","Debian 9 (stretch)",3,132,"HDD HGST_HUH721010ALE600 10TB 7200RPM",128GB,"PCI-e 3.0 x8 LSI9300-8e HBA 12Gbps SAS-SATA",IB-EDR,"ZFS 0.8.2, BeeGFS 7.1.3","Debian 9 (stretch)",,,5.650000,8.390000,0.230000,0.340000,31.210000,131.810000,39.340000,8.170000,18.720000,37.080000,9.750000,112.000000,,112.000000,,,2019-11-08-ISTAustriaBeeGFSBeeGFS-10-10.zip,1,11/8/19,,,https://github.com/IO500/submission-data/tree/master/IST%20Austria/IST%20Austria%20HPC/BeeGFS/2019/submission-187,,,,0,,,,0,,,,0,,,,0,,0,,,,,,,,,,,,,,,,,,,,,,,,,,,,,,,,,,0,,,0,,,,,,,,,,,,,,,,,,,,,,,,,,6.6300001144409
5,SC19,Sherlock/Regal,Stanford,Dell,Lustre,10,160,7.050000,1.640000,30.280000,19.300000,zip,1,sc19,2019-11-29,"Stanford Research Computing Center",11/8/19,,2013-05-28,2016-08-05,Sherlock/Regal,2.8.0,16,CentOS,7.6,3.10.0-957.27.2.el7.x86_64,1,1,HDD,128GB,SAS,Infiniband,2.8.0,6.7,18,108,NL-SAS7.2K,128GB,SAS,Infiniband,2.8.0,6.7,,,3.660000,6.680000,0.420000,0.710000,13.110000,129.690000,12.340000,11.730000,19.320000,41.740000,7.740000,460.000000,,460.000000,,,2019-11-08-StanfordSherlockRegalLustre-10-16.zip,1,11/8/19,,,https://github.com/IO500/submission-data/tree/master/Stanford/Sherlock/Regal/Sherlock/Regal/2019/submission-184,,,,0,,,,0,,,,0,,,,0,,0,,,,,,,,,,,,,,,,,,,,,,,,,,,,,,,,,,0,,,0,,,,,,,,,,,,,,,,,,,,,,,,,,7.0500001907349
6,SC19,"IST Austria HPC","IST Austria",Homemade@IST,BeeGFS,4,80,8.410000,1.770000,39.980000,23.820000,zip,,sc19,2019-11-19,"Janos Kiss",11/8/19,,2019-09-02,,BeeGFS,7.1.3,20,Debian,"Debian 9 (stretch)",4.9.0-9-amd64,2,2,"NVMe Samsung PM1725A 6.4TB",128GB,NVMe,IB-EDR,"EXT4, BeeGFS 7.1.3","Debian 9 (stretch)",3,132,"HDD HGST_HUH721010ALE600 10TB 7200RPM",128GB,"PCI-e 3.0 x8 LSI9300-8e HBA 12Gbps SAS-SATA",IB-EDR,"ZFS 0.8.2, BeeGFS 7.1.3","Debian 9 (stretch)",,,5.530000,7.810000,0.140000,1.630000,31.980000,161.530000,38.750000,8.200000,16.440000,91.110000,8.860000,300.000000,,300.000000,,,2019-11-08-ISTAustriaBeeGFSBeeGFS-4-20.zip,1,11/8/19,,,https://github.com/IO500/submission-data/tree/master/IST%20Austria/IST%20Austria%20HPC/BeeGFS/2019/submission-172,,,,0,,,,0,,,,0,,,,0,,0,,,,,,,,,,,,,,,,,,,,,,,,,,,,,,,,,,0,,,0,,,,,,,,,,,,,,,,,,,,,,,,,,8.4099998474121
7,SC21,Aion,ULHPC,DDN,SpectrumScale,128,256,11.345210,1.798376,71.572357,0.000000,,,sc21,4.54204672768079E+017,sebastien.varrette,9/28/21,,,,irisgpfs,5.0.5-7,2,RedHat,8.3,4.18.0-240.10.1,0,0,,,,,,,4,0,,,,,,,,,17.501989,20.638251,0.113342,0.255489,59.368146,106.298117,46.333091,18.152144,77.709539,105.259659,17.138451,925.457452,,925.457452,-,-,2021.09.28-17.08.10.zip,1,11/19/21,,,https://github.com/IO500/submission-data/tree/master/ULHPC/Aion/irisgpfs/2021/submission-583,,,,0,,,,0,,,,0,,,,0,,0,,,,,,,,,,,,,,,,,,,,,,,,,,,,,,,,,,0,,,0,,,,,,,,,,,,,,,,,,,,,,,,,,11.345199584961
8,SC19,Sherlock/Oak,Stanford,"Dell, QCT, HGST",Lustre,10,240,9.310000,1.890000,45.870000,26.680000,zip,1,sc19,2019-11-46,"Stanford Research Computing Center",11/8/19,,2016-11-01,2019-10-18,Oak,2.12.3,24,CentOS,7.6,3.10.0-957.27.2.el7.x86_64,2,2,SSD,3TB,SAS,Infiniband,2.10.8,7.6,8,180,NLSAS,0,SAS,Infiniband,2.10.8,7.6,,,7.150000,7.830000,0.230000,0.980000,15.430000,185.700000,20.640000,8.420000,46.750000,60.050000,15.320000,915.000000,,915.000000,,,2019-11-08-StanfordOakLustre-10-24.zip,,11/8/19,,,https://github.com/IO500/submission-data/tree/master/Stanford/Sherlock/Oak/Oak/2019/submission-166,,,,0,,,,0,,,,0,,,,0,,0,,,,,,,,,,,,,,,,,,,,,,,,,,,,,,,,,,0,,,0,,,,,,,,,,,,,,,,,,,,,,,,,,9.3100004196167
9,ISC20,SDumont,LNCC,Cay/HPE,Lustre,10,240,3.060000,2.320000,4.020000,5.640000,zip,1,isc20,2020-07-3,"AndrÃ© Ramos Carneiro",7/13/20,,2016-01-13,2020-04-13,scratch,2.12,24,"Red Hat Enterprise Linux Server",7.6,3.10.0-957.el7.x86_64,1,40,HDD,"64 GiB",SAS,"IB FDR",2.12,,10,40,HDD,"32 GiB",SAS,"IB FDR",2.12,,,,16.890000,14.550000,0.080000,1.560000,0.170000,13.590000,21.990000,0.170000,5.280000,15.360000,8.110000,12.000000,,12.000000,,,2020.07.10-16.18.50-scr.zip,,7/13/20,,https://www.vi4io.org/hpsl/2020/bra/LNCC/start,https://github.com/IO500/submission-data/tree/master/LNCC/SDumont/scratch/2020/submission-212,,,,0,,,,0,,,,0,,,,0,,0,,,,,,,,,,,,,,,,,,,,,,,,,,,,,,,,,,0,,,0,,,,,,,,,,,,,,,,,,,,,,,,,,3.0599999427795
10,SC19,nearline4,"Janelia Research Campus, HHMI",Qumulo,"Scale-out NAS",10,760,3.670000,2.450000,5.490000,7.070000,zip,1,sc19,2019-11-24,"Janelia Scientific Computing Systems",11/10/19,,112018,,"Qumulo FS",2.14.0.1,76,Scientific-Linux,7.6,3.10.0-957.10.1.el7.x86_64,0,3,SSD,,SATA,,,,40,480,HDD,64GB,SATA,10GbE,2.14.0.1,7.6,,,6.710000,8.320000,0.130000,4.990000,8.170000,147.780000,5.640000,0.180000,11.880000,10.280000,0.180000,31.000000,,31.000000,,,2019-11-10-JaneliaResearchCampusHowardHughesMedicalInstituteQumuloFSScale-outNAS-10-76.zip,1,11/10/19,,,https://github.com/IO500/submission-data/tree/master/Janelia%20Research%20Campus%2C%20HHMI/nearline4/Qumulo%20FS/2019/submission-208,,,,0,,,,0,,,,0,,,,0,,0,,,,,,,,,,,,,,,,,,,,,,,,,,,,,,,,,,0,,,0,,,,,,,,,,,,,,,,,,,,,,,,,,3.6700000762939
11,SC19,dm11,"Janelia Research Campus, HHMI",#N/A,"Scale-out NAS",10,760,6.420000,2.610000,15.820000,14.610000,zip,1,sc19,2019-11-43,"Janelia Scientific Computing Systems",11/10/19,,32018,,#N/A,8.1.2,76,Scientific-Linux,7.6,3.10.0-957.10.1.el7.x86_64,12,180,NAND,256GB,SAS,40GbE,8.1.2,7.6,56,840,HDD,128GB,SATA,40GbE,8.1.2,7.6,,,16.130000,13.390000,0.040000,5.950000,102.150000,290.650000,12.640000,0.990000,18.050000,13.610000,0.350000,123.000000,,123.000000,,,2019-11-10-JaneliaResearchCampusHowardHughesMedicalInstituteScale-outNAS-10-76.zip,1,11/10/19,,,https://github.com/IO500/submission-data/tree/master/Janelia%20Research%20Campus%2C%20HHMI/dm11/%23N/A/2019/submission-188,,,,0,,,,0,,,,0,,,,0,,0,,,,,,,,,,,,,,,,,,,,,,,,,,,,,,,,,,0,,,0,,,,,,,,,,,,,,,,,,,,,,,,,,6.4200000762939
12,SC20,"Archer 2 (test system)",EPCC,Cray,Lustre,10,80,10.680000,2.630000,43.430000,28.720000,zip,1,sc20,2020-11-6,"Julian Kunkel",10/30/20,,2020-10-10,,Work,2.12,8,SUSE,15.1,4.12.14-197.51_9.1.42-cray_shasta_c,2,0,,,,,,,12,0,HDD,,,,,,,,33.060000,11.920000,0.110000,1.140000,44.540000,125.160000,34.790000,21.210000,56.740000,129.940000,13.100000,32.000000,,32.000000,,,2020-10-30-EPCCWorkLustre-10-8.zip,1,10/30/20,,,https://github.com/IO500/submission-data/tree/master/EPCC/Archer%202%20%28test%20system%29/Work/2020/submission-472,,,,0,,,,0,,,,0,,,,0,,0,,,,,,,,,,,,,,,,,,,,,,,,,,,,,,,,,,0,,,0,,,,,,,,,,,,,,,,,,,,,,,,,,10.680000305176
13,SC21,SCC,GWDG,,BeeGFS,10,80,12.549643,2.631452,59.850429,0.000000,,1,sc21,3.83533251860745E+017,,10/26/21,,,,BeeGFS,,8,scientific,7.9,3.10.0-1160.24.1.el7.x86_64,2,2,,,SAS3,OPA,,,2,8,SSD,192,,Omni-Path,,,,,3.261078,8.852841,0.348750,4.762372,52.889747,309.023172,58.292741,11.789431,25.880817,76.652839,12.372046,597.201043,,597.201043,-,-,2021.10.24-18.15.48.zip,,11/19/21,,,https://github.com/IO500/submission-data/tree/master/GWDG/SCC/BeeGFS/2021/submission-582,,,,0,,,,0,,,,0,,,,0,,0,,,,,,,,,,,,,,,,,,,,,,,,,,,,,,,,,,0,,,0,,,,,,,,,,,,,,,,,,,,,,,,,,12.549599647522
14,SC19,BEAR-AI,"University of Birmingham",DDN,"Spectrum Scale",10,80,15.390000,2.740000,86.480000,46.090000,zip,1,sc19,2019-11-51,"Simon Thompson",11/10/19,,2019-04-01,2019-04-01,/ai,5.0.3.3,8,RHEL,7.6,4.14.0-115.7.1.el7a.ppc64le,0,0,,,,,,,4,20,NVMe,96GB,NVMe,Infiniband,5.0.2.3,"RHEL 7.6",,,8.880000,24.890000,0.540000,0.470000,103.110000,188.930000,51.040000,23.010000,124.970000,188.010000,11.720000,497.000000,,497.000000,,,2019-11-10-UniversityofBirminghamaiSpectrumScale-10-8.zip,,11/10/19,,,https://github.com/IO500/submission-data/tree/master/University%20of%20Birmingham/BEAR-AI//ai/2019/submission-138,,,,0,,,,0,,,,0,,,,0,,0,,,,,,,,,,,,,,,,,,,,,,,,,,,,,,,,,,0,,,0,,,,,,,,,,,,,,,,,,,,,,,,,,15.390000343323
15,SC19,nrs,"Janelia Research Campus, HHMI",Qumulo,"Scale-out NAS",10,760,4.190000,2.880000,6.110000,8.010000,zip,1,sc19,2019-11-36,"Janelia Scientific Computing Systems",11/10/19,,92016,,"Qumulo FS",2.14.0.1,76,Scientific-Linux,7.6,3.10.0-957.10.1.el7.x86_64,0,13,SSD,,SATA,,,,20,520,HDD,128GB,SATA,40GbE,2.14.0.1,7.6,,,5.440000,13.370000,0.170000,5.710000,9.030000,171.200000,10.770000,0.210000,9.810000,9.070000,0.180000,35.000000,,35.000000,,,2019-11-10-JaneliaResearchCampusHowardHughesMedicalInstituteQumuloFSScale-outNAS-10-76.zip,1,11/10/19,,,https://github.com/IO500/submission-data/tree/master/Janelia%20Research%20Campus%2C%20HHMI/nrs/Qumulo%20FS/2019/submission-206,,,,0,,,,0,,,,0,,,,0,,0,,,,,,,,,,,,,,,,,,,,,,,,,,,,,,,,,,0,,,0,,,,,,,,,,,,,,,,,,,,,,,,,,4.1900000572205
16,ISC20,Mistral,"German Climate Computing Center",Cray,Lustre1,10,120,6.920000,2.890000,16.570000,15.590000,zip,,isc20,2020-07-62,"Julian Kunkel",7/13/20,,2015-03-01,,Lustre01,2.11.0.300_cray_102_g3dbace1,12,RHEL,6.10,2.6.32-754.14.2.el6.x86_64,1,0,,,,Infiniband,,,62,5208,HDD,,,Infiniband,,,,,30.780000,25.730000,0.110000,0.790000,13.630000,37.680000,7.070000,9.680000,10.700000,29.890000,8.050000,63.000000,,63.000000,,,2020.05.19-12.12.45-app.zip,,7/13/20,,https://www.vi4io.org/hpsl/2020/deu/dkrz/start,https://github.com/IO500/submission-data/tree/master/German%20Climate%20Computing%20Center/Mistral/Lustre01/2020/submission-185,,,,0,,,,0,,,,0,,,,0,,0,,,,,,,,,,,,,,,,,,,,,,,,,,,,,,,,,,0,,,0,,,,,,,,,,,,,,,,,,,,,,,,,,6.9200000762939
17,ISC20,Mistral,"German Climate Computing Center",Cray,Lustre1,10,120,7.920000,2.930000,21.360000,18.570000,zip,,isc20,2020-07-27,"Julian Kunkel",7/13/20,,2015-03-01,,Lustre01,2.11.0.300_cray_102_g3dbace1,12,RHEL,6.10,2.6.32-754.14.2.el6.x86_64,1,0,,,,Infiniband,,,62,5208,HDD,,,Infiniband,,,,,28.680000,26.080000,0.110000,0.930000,14.030000,37.480000,8.060000,10.550000,15.590000,30.200000,8.340000,248.000000,,248.000000,,,2020.05.19-12.12.45-scr.zip,,7/13/20,,https://www.vi4io.org/hpsl/2020/deu/dkrz/start,https://github.com/IO500/submission-data/tree/master/German%20Climate%20Computing%20Center/Mistral/Lustre01/2020/submission-176,,,,0,,,,0,,,,0,,,,0,,0,,,,,,,,,,,,,,,,,,,,,,,,,,,,,,,,,,0,,,0,,,,,,,,,,,,,,,,,,,,,,,,,,7.9200000762939
18,ISC20,"NCSA Industry System","National Center for Supercomputing Applications",DDN/Dell,"Spectrum Scale",8,96,12.370000,3.030000,50.540000,33.310000,zip,,isc20,2020-07-4,"National Center for Supercomputing Applications",7/13/20,,03/2015,10/2019,scratch,5.0.5.0,12,RHEL,7.8,3.10.0-1127.10.1.el7.x86_64,4,4,NVMe,128,Infiniband,Infiniband,5.0.5.0,7.8,4,84,HDD,128,Infiniband,Infiniband,5.0.5.0,7.8,,,9.380000,10.080000,0.770000,1.150000,81.880000,222.300000,58.880000,8.360000,21.410000,23.260000,8.440000,1131.000000,,1131.000000,,,2020.07.02-12.32.35-app.zip,1,7/13/20,,,https://github.com/IO500/submission-data/tree/master/National%20Center%20for%20Supercomputing%20Applications/NCSA%20Industry%20System/scratch/2020/submission-153,,,,0,,,,0,,,,0,,,,0,,0,,,,,,,,,,,,,,,,,,,,,,,,,,,,,,,,,,0,,,0,,,,,,,,,,,,,,,,,,,,,,,,,,12.369999885559
19,ISC20,"NCSA Industry System","National Center for Supercomputing Applications",DDN/Dell,"Spectrum Scale",8,96,11.280000,3.040000,41.780000,29.400000,zip,,isc20,2020-07-44,"National Center for Supercomputing Applications",7/13/20,,03/2015,10/2019,scratch,5.0.5.0,12,RHEL,7.8,3.10.0-1127.10.1.el7.x86_64,4,4,NVMe,128,Infiniband,Infiniband,5.0.5.0,7.8,4,84,HDD,128,Infiniband,Infiniband,5.0.5.0,7.8,,,9.290000,10.160000,0.810000,1.120000,66.970000,222.530000,55.620000,12.480000,21.720000,23.210000,9.070000,196.000000,,196.000000,,,2020.07.02-12.32.35-scr.zip,1,7/13/20,,,https://github.com/IO500/submission-data/tree/master/National%20Center%20for%20Supercomputing%20Applications/NCSA%20Industry%20System/scratch/2020/submission-158,,,,0,,,,0,,,,0,,,,0,,0,,,,,,,,,,,,,,,,,,,,,,,,,,,,,,,,,,0,,,0,,,,,,,,,,,,,,,,,,,,,,,,,,11.279999732971
20,ISC20,VastTest,"Janelia Research Campus, HHMI","Vast Data","Scale-out NAS",10,620,6.200000,3.510000,10.950000,12.620000,zip,,isc20,2020-07-31,"Janelia Scientific Computing Systems",7/13/20,,11/2019,,Vast,2.0.7,62,Scientific-Linux,7.7,3.10.0-1062.9.1.el7.x86_64,4,48,3DXP,256GB,NVME,50GbE,2.0.7,7.7,1,132,Flash,64GB,NVMe,100GbE,2.0.7,7.7,,,2.890000,12.630000,1.100000,3.750000,12.460000,84.280000,9.630000,2.250000,11.520000,20.810000,1.790000,21.000000,,21.000000,,,2019.12.19-06.01.15.zip,,7/13/20,,,https://github.com/IO500/submission-data/tree/master/Janelia%20Research%20Campus%2C%20HHMI/VastTest/Vast/2020/submission-190,,,,0,,,,0,,,,0,,,,0,,0,,,,,,,,,,,,,,,,,,,,,,,,,,,,,,,,,,0,,,0,,,,,,,,,,,,,,,,,,,,,,,,,,6.1999998092651
21,ISC20,VastTest,"Janelia Research Campus, HHMI","Vast Data","Scale-out NAS",10,620,4.980000,3.560000,6.960000,9.370000,zip,,isc20,2020-07-12,"Janelia Scientific Computing Systems",7/13/20,,12/2019,,Vast,2.0.7,62,Scientific-Linux,7.7,3.10.0-1062.9.1.el7.x86_64,4,48,3DXP,256GB,NVME,50GbE,2.0.7,7.7,1,132,Flash,64GB,NVMe,100GbE,2.0.7,7.7,,,3.020000,13.080000,1.140000,3.570000,12.800000,82.420000,10.240000,2.270000,11.880000,22.250000,2.020000,0.000000,,0.000000,,,2019.12.19-06.01.15.zip,,7/13/20,,,https://github.com/IO500/submission-data/tree/master/Janelia%20Research%20Campus%2C%20HHMI/VastTest/Vast/2020/submission-201,,,,0,,,,0,,,,0,,,,0,,0,,,,,,,,,,,,,,,,,,,,,,,,,,,,,,,,,,0,,,0,,,,,,,,,,,,,,,,,,,,,,,,,,4.9800000190735
22,ISC20,HAL,"National Center for Supercomputing Applications",DDN,"Spectrum Scale",10,100,11.310000,3.620000,35.370000,27.860000,zip,1,isc20,2020-07-26,"National Center for Supercomputing Applications",7/13/20,,09/2019,,HAL,5.0.5.0,10,CentOS,7.7,4.18.0-147.0.3.el7.ppc64le,8,2,NVMe,32,Infiniband,Infiniband,5.0.5.0,7.6,8,2,NVMe,32,Infiniband,Infiniband,5.0.5.0,7.6,,,14.860000,12.740000,0.430000,2.100000,71.460000,105.830000,33.260000,2.390000,65.370000,104.910000,0.460000,1300.000000,,1300.000000,,,2020.06.27-06.53.38-scr.zip,1,7/13/20,,,https://github.com/IO500/submission-data/tree/master/National%20Center%20for%20Supercomputing%20Applications/HAL/HAL/2020/submission-157,,,,0,,,,0,,,,0,,,,0,,0,,,,,,,,,,,,,,,,,,,,,,,,,,,,,,,,,,0,,,0,,,,,,,,,,,,,,,,,,,,,,,,,,11.310000419617
23,ISC20,HAL,"National Center for Supercomputing Applications",DDN,"Spectrum Scale",10,100,11.130000,3.630000,34.150000,27.240000,zip,1,isc20,2020-07-61,"National Center for Supercomputing Applications",7/13/20,,09/2019,,HAL,5.0.5.0,10,CentOS,7.7,4.18.0-147.0.3.el7.ppc64le,8,2,NVMe,32,Infiniband,Infiniband,5.0.5.0,7.6,8,2,NVMe,32,Infiniband,Infiniband,5.0.5.0,7.6,,,14.240000,12.740000,0.480000,1.980000,74.670000,107.800000,32.590000,1.740000,51.800000,106.700000,0.470000,1553.000000,,1553.000000,,,2020.06.27-06.53.38-app.zip,1,7/13/20,,,https://github.com/IO500/submission-data/tree/master/National%20Center%20for%20Supercomputing%20Applications/HAL/HAL/2020/submission-159,,,,0,,,,0,,,,0,,,,0,,0,,,,,,,,,,,,,,,,,,,,,,,,,,,,,,,,,,0,,,0,,,,,,,,,,,,,,,,,,,,,,,,,,11.130000114441
24,ISC20,VastTest,"Janelia Research Campus, HHMI","Vast Data","Scale-out NAS",10,620,5.680000,3.670000,8.800000,11.070000,zip,,isc20,2020-07-20,"Janelia Scientific Computing Systems",7/13/20,,11/2019,8/2019,Vast,2.0.7,62,Scientific-Linux,7.7,3.10.0-1062.9.1.el7.x86_64,4,48,3DXP,256GB,NVME,50GbE,2.0.7,7.7,1,132,Flash,64GB,NVMe,100GbE,2.0.7,7.7,,,2.750000,14.890000,1.170000,3.800000,12.610000,88.410000,10.020000,2.250000,11.940000,21.890000,1.860000,3.000000,,3.000000,,,2019.12.18-11.50.43.zip,,7/13/20,,,https://github.com/IO500/submission-data/tree/master/Janelia%20Research%20Campus%2C%20HHMI/VastTest/Vast/2020/submission-197,,,,0,,,,0,,,,0,,,,0,,0,,,,,,,,,,,,,,,,,,,,,,,,,,,,,,,,,,0,,,0,,,,,,,,,,,,,,,,,,,,,,,,,,5.6799998283386
25,ISC21,PACE-Phoenix,"Georgia Institute of Technology",DDN,Lustre,10,240,17.073576,4.520995,64.478496,,,,isc21,,,6/10/21,,,,lustre,,24,RedHat,7.6,3.10.0-957.27.2.el7.x86_64,2,2,Other,,NVMe,,,,8,8,Other,,,"Infiniband, 100 GBit, 2x",,7.7.1908,,,18.919953,14.107625,0.675675,2.316457,48.756646,130.680369,28.962735,25.933313,33.149291,91.318479,18.770173,,,1098.692729,,,2021.06.08-17.24.08.zip,1,,,,https://github.com/IO500/submission-data/tree/master/Georgia%20Institute%20of%20Technology/PACE-Phoenix/lustre/2021/submission-551,,,,0,,,,0,,,,0,,,,0,,0,,,,,,,,,,,,,,,,,,,,,,,,,,,,,,,,,,0,,,0,,,,,,,,,,,,,,,,,,,,,,,,,,17.073600769043
26,SC19,TigerShark,SUSE,"SUSE, Intel, Lenovo","SUSE Enterprise Storage - CephFS",10,80,12.430000,4.640000,33.340000,29.100000,zip,1,sc19,2019-11-17,"David Byte",11/7/19,,2018-11-01,2018-10-01,,"6 (14.2.4)",8,"SUSE Linux Enterprise","15 SP1",4.12.14-197.21-default,15,1,NVME,32GB,NVMe,"100Gb Ethernet","6 (14.2.4)","15 SP1",10,119,SSD,96GB,SATA,"100Gb Ethernet","6 (14.2.4)","15 SP1",,,14.620000,7.720000,1.270000,3.230000,25.740000,105.160000,18.020000,9.290000,37.030000,41.550000,6.280000,349.000000,,349.000000,,,2019-11-07-SUSESUSEEnterpriseStorage-CephFS-10-8.zip,1,11/7/19,,,,,,,0,,,,0,,,,0,,,,0,,0,,,,,,,,,,,,,,,,,,,,,,,,,,,,,,,,,,0,,,0,,,,,,,,,,,,,,,,,,,,,,,,,,12.430000305176
27,SC19,Sherlock/Fir,Stanford,"Dell, QCT, HGST",Lustre,10,240,18.250000,5.230000,63.740000,46.640000,zip,1,sc19,2019-11-28,"Stanford Research Computing Center",11/8/19,,2019-02-05,2019-10-16,Fir,2.12.3,24,CentOS,7.6,3.10.0-957.27.2.el7.x86_64,4,1,SSD,18TB,SAS,IB-HDR,2.12.3,7.6,16,96,NLSAS,0,SAS,IB-HDR,2.12.3,7.6,,,25.010000,23.230000,0.560000,2.290000,84.520000,354.370000,52.550000,20.930000,40.980000,34.230000,12.390000,475.000000,,475.000000,,,2019-11-08-StanfordFirLustre-10-24.zip,,11/8/19,,,https://github.com/IO500/submission-data/tree/master/Stanford/Sherlock/Fir/Fir/2019/submission-131,,,,0,,,,0,,,,0,,,,0,,0,,,,,,,,,,,,,,,,,,,,,,,,,,,,,,,,,,0,,,0,,,,,,,,,,,,,,,,,,,,,,,,,,18.25
28,SC19,TigerShark,SUSE,"SUSE, Intel, Lenovo","SUSE Enterprise Storage - CephFS",15,120,14.910000,5.740000,38.720000,34.510000,zip,,sc19,2019-11-40,"David Byte",11/7/19,,2018-11-01,2019-10-01,,"6 (14.2.4)",8,"SUSE Linux Enterprise","15 SP1",4.12.14-197.21-default,15,1,NVME,32GB,NVMe,"100Gb Ethernet","6 (14.2.4)","15 SP1",10,119,SSD,96GB,SATA,"100Gb Ethernet","6 (14.2.4)","15 SP1",,,16.070000,9.140000,1.570000,4.700000,32.820000,127.920000,20.840000,12.920000,41.640000,68.790000,6.220000,251.000000,,251.000000,,,2019-11-07-SUSESUSEEnterpriseStorage-CephFS-15-8.zip,1,11/7/19,,,,,,,0,,,,0,,,,0,,,,0,,0,,,,,,,,,,,,,,,,,,,,,,,,,,,,,,,,,,0,,,0,,,,,,,,,,,,,,,,,,,,,,,,,,14.909999847412