id,release_id,information_system,information_institution,information_storage_vendor,information_filesystem_type,information_client_nodes,information_client_total_procs,io500_score,io500_bw,io500_md,io500_tot_iops,information_data,information_10_node_challenge,information_list_name,information_identifier,information_submitter,information_submission_date,information_embargo_end_date,information_storage_install_date,information_storage_refresh_date,information_filesystem_name,information_filesystem_version,information_client_procs_per_node,information_client_operating_system,information_client_operating_system_version,information_client_kernel_version,information_md_nodes,information_md_storage_devices,information_md_storage_type,information_md_volatile_memory_capacity,information_md_storage_interface,information_md_network,information_md_software_version,information_md_operating_system_version,information_ds_nodes,information_ds_storage_devices,information_ds_storage_type,information_ds_volatile_memory_capacity,information_ds_storage_interface,information_ds_network,information_ds_software_version,information_ds_operating_system_version,information_note,information_best,ior_easy_write,ior_easy_read,ior_hard_write,ior_hard_read,mdtest_easy_write,mdtest_easy_stat,mdtest_easy_delete,mdtest_hard_write,mdtest_hard_read,mdtest_hard_stat,mdtest_hard_delete,find_easy,find_hard,find_mixed,marker_score,marker_md,storage_data,include_in_io500,valid_from,valid_to,cdcl_url,repository_url,user_id,result_tar,result_tar_dir,result_tar_size,result_tar_type,job_script,job_script_dir,job_script_size,job_script_type,job_output,job_output_dir,job_output_size,job_output_type,system_information,system_information_dir,system_information_size,system_information_type,information_client_sockets,information_ds_clock,information_ds_media_secondary_count,information_ds_media_primary_vendor,information_ds_model,information_ds_media_secondary_capacity,information_md_spdk,information_md_media_secondary_vendor,information_ds_kernel_version,status_old,information_client_interconnect_vendor,information_ds_interconnect_rdma,information_ds_media_secondary_vendor,status_id,information_client_dpdk,information_md_interconnect_links,information_md_dpdk,information_ds_architecture,information_md_interconnect_vendor,information_ds_interconnect_links,information_client_interconnect_type,information_ds_cores_per_socket,information_md_media_primary_count,information_md_media_secondary_count,information_client_spdk,information_md_media_secondary_capacity,information_md_kernel_version,information_ds_interconnect_type,information_ds_interconnect_vendor,information_md_architecture,information_ds_sockets,information_md_interconnect_rdma,information_client_model,information_md_media_secondary_interface,information_client_interconnect_links,information_ds_operating_system,information_ds_spdk,information_client_cores_per_socket,information_md_interconnect_bandwidth,information_client_volatile_memory_capacity,information_client_clock,information_ds_media_secondary_interface,information_md_clock,information_ds_media_primary_count,information_client_architecture,information_client_interconnect_rdma,information_md_media_primary_type,information_md_model,information_ds_interconnect_bandwidth,information_md_operating_system,information_ds_dpdk,information_client_interconnect_bandwidth,information_ds_media_primary_interface,information_md_cores_per_socket,information_ds_media_primary_capacity,information_md_media_secondary_type,information_ds_media_secondary_type,information_md_media_primary_vendor,information_md_media_primary_interface,information_md_media_primary_capacity,information_md_interconnect_type,information_ds_media_primary_type,information_md_sockets,score
1,ISC21,"Pengcheng Cloudbrain-II on Atlas 900","Pengcheng Laboratory",Pengcheng,MadFS,10,1800,2595.890000,193.766302,34777.267070,,,,isc21,,"Pengcheng Laboratory and Tsinghua University",6/9/21,,2020-10,,Pengcheng,1,180,KylinOS,v10sp1,4.19.148,,,,,,,,,50,,,,,"Ethernet, 100 GBit, 2x",,,,,222.987510,149.939929,197.272000,213.722239,19176.710150,36333.268050,26920.996930,8494.136829,15692.363040,35438.079690,15239.971830,,,1584644.889000,,,NULL,1,,,,,,,,0,,,,0,,,,0,,,,0,,0,,,,,,,,,,,,,,,,,,,,,,,,,,,,,,,,,,0,,,0,,,,,,,,,,,,,,,,,,,,,,,,,,2595.8898925781
2,SC21,Athena,"Huawei HPDA Lab",Huawei,OceanFS,10,1720,2395.027851,314.556370,18235.708940,0.000000,,1,sc21,4.3839474780424E+016,"Phost Feng",11/2/21,,2021-06-16,,"OceanStor Pacific",8.1.1,172,CentOS,7.6.1810,3.10.0-957,0,0,,,,,,,80,800,SSD,,NVMe,Ethernet,,,,,301.767026,351.516185,274.387848,336.365894,4638.639800,125444.196700,4704.730688,3732.752487,1214.262346,125645.190200,4724.230643,1660299.894000,,1660299.894000,-,-,2021.11.01-15.13.47.zip,1,11/19/21,,,https://github.com/IO500/submission-data/tree/master/Huawei%20HPDA%20Lab/Athena/OceanStor%20Pacific/2021/submission-579,,,,0,,,,0,,,,0,,,,0,,0,,,,,,,,,,,,,,,,,,,,,,,,,,,,,,,,,,0,,,0,,,,,,,,,,,,,,,,,,,,,,,,,,2395.0300292969
3,SC21,"OceanStor Pacific","Olympus Lab",Huawei,OceanFS,10,1720,2298.691341,317.072880,16664.881200,0.000000,,1,sc21,8.93667011109576E+017,"Phost Feng",10/29/21,,2021-04-30,,"OceanStor Pacific",8.1.1,172,CentOS,7.6.1810,3.10.0-957,0,0,,,,,,,40,400,SSD,,NVMe,Ethernet,,,,,300.506711,357.784942,282.139748,333.193012,4766.548729,125682.525500,4771.774125,2723.771711,1068.374898,126232.865400,4803.187258,1179404.068000,,1179404.068000,-,-,2021.10.29-17.15.21.zip,1,11/19/21,,,https://github.com/IO500/submission-data/tree/master/Olympus%20Lab/OceanStor%20Pacific/OceanStor%20Pacific/2021/submission-592,,,,0,,,,0,,,,0,,,,0,,0,,,,,,,,,,,,,,,,,,,,,,,,,,,,,,,,,,0,,,0,,,,,,,,,,,,,,,,,,,,,,,,,,2298.6899414062
4,ISC21,Endeavour,Intel,Intel,DAOS,10,1440,1859.556390,398.765034,8671.647896,,,,isc21,,"Mohamad Chaarawi",6/9/21,,2020-09,,DAOS,1.3.101,144,CentOS,,4.18.0-240.22.1.el8_3.crt2.x86_64,,12,,,,,,,40,8,PMEM,,NVDIMM,"Infiniband, 200 GBit",,7,,,538.829306,586.050057,389.251396,205.708472,13347.628000,12962.256060,7556.862360,6278.339486,10042.811820,12320.820540,5489.515231,,,5734.732097,,,2021.05.31-18.01.25.zip,1,,,,https://github.com/IO500/submission-data/tree/master/Intel/Endeavour/DAOS/2021/submission-554,,,,0,,,,0,,,,0,,,,0,,0,,,,,,,,,,,,,,,,,,,,,,,,,,,,,,,,,,0,,,0,,,,,,,,,,,,,,,,,,,,,,,,,,1859.5600585938
5,SC21,Kongming,"BPFS Lab",,BPFS,10,800,972.603929,96.260247,9827.093046,0.000000,,1,sc21,7.04806058185321E+017,,10/31/21,,,,BPFS,,80,CentOS,7.5,4.14,0,0,,,,,,,35,280,SSD,,NVMe,Ethernet,,,,,91.347802,75.765181,106.138701,116.881653,7050.545698,11081.175060,7893.367693,3485.201281,4086.084567,10336.178180,8042.844092,119131.006300,,119131.006300,-,-,2021.10.31-19.21.04.zip,1,11/19/21,,,https://github.com/IO500/submission-data/tree/master/BPFS%20Lab/Kongming/BPFS/2021/submission-588,,,,0,,,,0,,,,0,,,,0,,0,,,,,,,,,,,,,,,,,,,,,,,,,,,,,,,,,,0,,,0,,,,,,,,,,,,,,,,,,,,,,,,,,972.60400390625
6,ISC20,Wolf,Intel,Intel,DAOS,10,420,758.710000,164.770000,3493.560000,2126.150000,zip,1,isc20,2020-07-37,Intel,7/13/20,,,,DAOS,1.1,42,CentOS,7.7,3.10.0-1062.12.1.el7.x86_64,0,0,,,,,,,30,60,"Optane Persistent Memory",512GB,DDR-T,Omnipath,1.1,7.7,,,178.290000,212.830000,120.620000,161.040000,4828.030000,4600.360000,2795.340000,2317.040000,3231.390000,4109.810000,2768.940000,4195.000000,,4195.000000,,,2020.06.29-04.46.44-scr.zip,1,7/13/20,,,https://github.com/IO500/submission-data/tree/master/Intel/Wolf/DAOS/2020/submission-6,,,,0,,,,0,,,,0,,,,0,,0,,,,,,,,,,,,,,,,,,,,,,,,,,,,,,,,,,0,,,0,,,,,,,,,,,,,,,,,,,,,,,,,,758.71002197266
7,ISC21,Lenovo-Lenox,Lenovo,Lenovo,DAOS,10,960,612.870000,105.276201,3567.847794,,,,isc21,,,6/11/21,,2020-04,,Lenovo,1.3.101-2,96,CentOS,7.7.1908,3.10.0-1062.18.1.el7.x86_64,,,,,,,,,12,,,,,,,7.9.2009,,,112.999945,108.468716,108.445586,92.411538,4815.063677,9277.016263,1982.357356,1714.672326,1923.210161,8016.986057,2217.838889,,,5057.189716,,,2021.06.09-14.47.16.zip,1,,,,https://github.com/IO500/submission-data/tree/master/Lenovo/Lenovo-Lenox/Lenovo/2021/submission-545,,,,0,,,,0,,,,0,,,,0,,0,,,,,,,,,,,,,,,,,,,,,,,,,,,,,,,,,,0,,,0,,,,,,,,,,,,,,,,,,,,,,,,,,612.86999511719
8,SC21,ASTRA,"National Research Center of Tranlational Medicine at Shanghai Ruijin Hospital",NRCTM,DAOS,10,360,511.021541,87.496411,2984.614027,0.000000,,1,sc21,4.98513563854882E+017,"LU Gang",10/29/21,,2021-08-01,,mustang,2.1.100,36,CentOS,7.9,3.10.0-1160.36.2.el7.x86_64,0,0,,,,,,,25,300,PMEM,,NVDIMM,,,,,,97.884571,102.354627,71.710894,81.574438,4896.241935,5041.119244,2179.374241,1754.731265,3456.875758,4392.239470,1561.463428,2813.659509,,2813.659509,-,-,2021.10.23-10.42.55.zip,1,11/19/21,,,https://github.com/IO500/submission-data/tree/master/National%20Research%20Center%20of%20Tranlational%20Medicine%20at%20Shanghai%20Ruijin%20Hospital/ASTRA/mustang/2021/submission-584,,,,0,,,,0,,,,0,,,,0,,0,,,,,,,,,,,,,,,,,,,,,,,,,,,,,,,,,,0,,,0,,,,,,,,,,,,,,,,,,,,,,,,,,511.02200317383
9,ISC20,Frontera,TACC,Intel,DAOS,10,420,508.880000,79.160000,3271.490000,1593.860000,zip,1,isc20,2020-07-18,Intel,7/13/20,,,,DAOS,1.1,42,CentOS,7.8,3.10.0-1127.13.1.el7.x86_64,0,0,,,,,,,15,24,"Optane Persistent Memory",256GB,DDR-T,Infiniband,1.1,7.8,,,97.470000,72.610000,83.420000,66.510000,5151.860000,4672.870000,2788.830000,2343.710000,3215.920000,4081.080000,2716.130000,2339.000000,,2339.000000,,,2020.07.11-14.40.08-scr.zip,1,7/13/20,,,https://github.com/IO500/submission-data/tree/master/TACC/Frontera/DAOS/2020/submission-12,,,,0,,,,0,,,,0,,,,0,,0,,,,,,,,,,,,,,,,,,,,,,,,,,,,,,,,,,0,,,0,,,,,,,,,,,,,,,,,,,,,,,,,,508.88000488281
10,ISC21,Venus2,"National Supercomputer Center in GuangZhou","National Supercomputer Center in GuangZhou",kapok,10,480,474.098000,91.635022,2452.868383,,,,isc21,,"NSCC-GZ FS team",6/11/21,,2021-04-28,,Venus2,1.2,48,CentOS,7.6.1810,3.10.0-957.el7.x86_64,,,,,,,,,38,,,,,"Ethernet, 100 GBit",,,,,95.160713,90.207121,93.938078,87.439121,1573.213289,4051.274375,2462.458052,804.639783,2301.662948,3092.230319,1964.270430,,,7422.146411,,,2021.06.11-18.18.54.zip,1,,,,https://github.com/IO500/submission-data/tree/master/National%20Supercomputer%20Center%20in%20GuangZhou/Venus2/Venus2/2021/submission-538,,,,0,,,,0,,,,0,,,,0,,0,,,,,,,,,,,,,,,,,,,,,,,,,,,,,,,,,,0,,,0,,,,,,,,,,,,,,,,,,,,,,,,,,474.09799194336
11,ISC20,Presque,"Argonne National Laboratory","Argonne National Laboratory",DAOS,10,380,440.640000,95.800000,2026.800000,1234.370000,zip,1,isc20,2020-07-34,"Argonne National Laboratory",7/13/20,,2019-11-15,2019-11-15,DAOS,1.1,38,RHEL,7.7,3.10.0-1062.4.3.el7.x86_64,8,12,"Intel Apache Pass 128GB DIMM",384,DIMM,100gE,1.1,7.7,8,12,NVMe-SSD,384,NVMe,100gE,1.1,7.7,,,133.280000,131.950000,80.920000,59.190000,3315.180000,3403.630000,1916.960000,725.920000,1575.540000,2900.140000,1822.730000,2178.000000,,2178.000000,,,2020.07.10-10.28.13-scr.zip,1,7/13/20,,,https://github.com/IO500/submission-data/tree/master/Argonne%20National%20Laboratory/Presque/DAOS/2020/submission-16,,,,0,,,,0,,,,0,,,,0,,0,,,,,,,,,,,,,,,,,,,,,,,,,,,,,,,,,,0,,,0,,,,,,,,,,,,,,,,,,,,,,,,,,440.64001464844
12,SC21,"QCT DevCloud","QCT DevCloud",QCT,DAOS,10,560,427.274472,102.854524,1774.967866,0.000000,,1,sc21,2.81298341357477E+017,,11/1/21,,,,QCT,1.3.106,56,CentOS,8.3,4.18.0-240,0,0,,,,,,,4,64,PMEM,512,NVDIMM,Infiniband,,,,,119.560689,178.243087,50.510865,103.969915,2606.603625,4368.152777,965.623009,821.912330,2590.701460,3196.019286,1023.352966,1286.666016,,1286.666016,-,-,2021.10.31-23.07.20.zip,1,11/19/21,,,https://github.com/IO500/submission-data/tree/master/QCT%20DevCloud/QCT%20DevCloud/QCT/2021/submission-581,,,,0,,,,0,,,,0,,,,0,,0,,,,,,,,,,,,,,,,,,,,,,,,,,,,,,,,,,0,,,0,,,,,,,,,,,,,,,,,,,,,,,,,,427.27398681641
13,ISC21,,Supermicro,Supermicro,DAOS,10,1120,415.039693,112.174143,1535.629705,,,,isc21,,,6/11/21,,,,SYS-120U-TNR,1.13.101,112,,,,,,,,,,,,4,,,,,,,,,,113.491924,163.248695,88.264742,96.820899,3785.499014,4405.937075,1720.793799,1000.790372,131.407871,2281.987628,1476.884379,,,2430.958209,,,2021.06.11-04.35.19.zip,1,,,,,,,,0,,,,0,,,,0,,,,0,,0,,,,,,,,,,,,,,,,,,,,,,,,,,,,,,,,,,0,,,0,,,,,,,,,,,,,,,,,,,,,,,,,,415.04000854492
14,SC19,"DGX-2H SuperPOD",NVIDIA,DDN,Lustre,10,400,249.500000,86.970000,715.760000,597.160000,zip,1,sc19,2019-11-1,NVIDIA,11/12/19,111919,11/05,110519,Exascaler,5,40,"NVIDIA DGX-OS",4.02,4.15.0-50-generic,10,2,NVMe,1.92TB,"Mellanox EDR InfiniBand","Mellanox EDR InfiniBand",Exascaler,Exa5.0,10,21,NVMe,1.92TB,"Mellanox EDR InfiniBand","Mellanox EDR InfiniBand",Exascaler,Exa5.0,,,273.160000,286.170000,11.160000,65.590000,799.580000,2000.810000,485.870000,446.270000,472.520000,881.030000,584.580000,816.000000,,816.000000,,,2019-11-12-NVIDIAExascalerLustre-10-40.zip,1,11/12/19,,,https://github.com/IO500/submission-data/tree/master/NVIDIA/DGX-2H%20SuperPOD/Exascaler/2019/submission-22,,,,0,,,,0,,,,0,,,,0,,0,,,,,,,,,,,,,,,,,,,,,,,,,,,,,,,,,,0,,,0,,,,,,,,,,,,,,,,,,,,,,,,,,249.5
15,SC20,NextGENIO,EPCC,"BSC & JGU",GekkoFS,10,3800,239.370000,45.790000,1251.320000,699.780000,zip,1,sc20,2020-11-23,"Ramon Nou",10/30/20,,2019-01-01,2020-10-10,GekkoFS,0.9dev,380,CentOS,,3.10.0-862.14.4.el7.x86_64,31,2,3DXPNVMeSSDv,2,NVMe,Omnipath,0.8dev,,31,2,3DXPNVMeSSD,2,NVMe,Omnipath,0.9dev,,,,73.660000,76.410000,26.840000,29.100000,1709.390000,1926.370000,1844.140000,288.530000,583.340000,1721.460000,691.370000,4942.000000,,4942.000000,,,2020-10-30-EPCCGekkoFSGekkoFS-10-380.zip,1,10/30/20,,,https://github.com/IO500/submission-data/tree/master/EPCC/NextGENIO/GekkoFS/2020/submission-455,,,,0,,,,0,,,,0,,,,0,,0,,,,,,,,,,,,,,,,,,,,,,,,,,,,,,,,,,0,,,0,,,,,,,,,,,,,,,,,,,,,,,,,,239.36999511719
16,ISC21,OceanStor,"Olympus Storage Technology Innovation Lab",Huawei,OceanFS,10,960,220.098689,69.487468,697.153517,,,,isc21,,"Rui Feng",6/12/21,,2021-04-30,,OceanStor,8.1.0,96,CentOS,7.6.1810,3.10.0-957,,,,,,,,,40,,,,,,,,,,91.692831,117.693402,44.052149,49.042359,649.375424,1627.183495,693.617778,147.006598,327.059339,752.040071,174.192330,,,12087.636530,,,2021.06.11-15.58.50.zip,1,,,,https://github.com/IO500/submission-data/tree/master/Olympus%20Storage%20Technology%20Innovation%20Lab/OceanStor/OceanStor/2021/submission-543,,,,0,,,,0,,,,0,,,,0,,0,,,,,,,,,,,,,,,,,,,,,,,,,,,,,,,,,,0,,,0,,,,,,,,,,,,,,,,,,,,,,,,,,220.09899902344
17,SC20,"MOGON II","Johannes Gutenberg University Mainz","JGU (ADA-FS)& BSC (NEXTGenIO)",GekkoFS,10,240,167.640000,22.970000,1223.590000,547.750000,zip,1,sc20,2020-11-3,"Marc-AndrÃ© Vef",10/30/20,,2017-10-01,,GekkoFS,0.9dev,24,CentOS,,3.10.0-1127.8.2.el7.x86_64,224,1,"Intel SSD DC S4600 Series",,SATA,Omnipath,0.9dev,,224,1,"Intel SSD DC S4600 Series",,SATA,Omnipath,0.9dev,,,,42.320000,26.900000,17.540000,13.940000,2019.870000,1970.750000,2082.080000,426.960000,419.000000,2030.350000,377.660000,4419.000000,,4419.000000,,,2020-10-30-JohannesGutenbergUniversityMainzGekkoFSGekkoFS-10-24.zip,1,10/30/20,,,https://github.com/IO500/submission-data/tree/master/Johannes%20Gutenberg%20University%20Mainz/MOGON%20II/GekkoFS/2020/submission-457,,,,0,,,,0,,,,0,,,,0,,0,,,,,,,,,,,,,,,,,,,,,,,,,,,,,,,,,,0,,,0,,,,,,,,,,,,,,,,,,,,,,,,,,167.63999938965
18,SC20,DIME,DDN,DDN,IME,10,110,161.530000,101.600000,256.780000,317.550000,zip,1,sc20,2020-11-7,"DDN IME",10/30/20,,2018-01-03,,,1.4.1,11,CentOS,7.7,3.1,2,17,SSD,128GB,EDR,IB-EDR,"Lustre 2.13","Centos 7.7",6,18,NVMe-SSD,128GB,NVMe,IB-EDR,"IME 1.4.1","Centos 7.7",,,104.450000,99.040000,105.460000,97.680000,162.050000,837.200000,201.210000,37.490000,326.310000,884.260000,23.470000,2728.000000,,2728.000000,,,2020-10-30-DDNIME-10-11.zip,,10/30/20,,,,,,,0,,,,0,,,,0,,,,0,,0,,,,,,,,,,,,,,,,,,,,,,,,,,,,,,,,,,0,,,0,,,,,,,,,,,,,,,,,,,,,,,,,,161.5299987793
19,SC19,WekaIO,WekaIO,WekaIO,"WekaIO Matrix",10,2610,156.510000,56.220000,435.760000,370.880000,zip,1,sc19,2019-11-12,"Alexander Howard",11/12/19,,2019-11-11,,WekaIO,3.5,261,CentOS,7.6.1810,3.10.0-957.el7.x86_64,26,6,NVMe,"352.0 GB",NVMe,"Infiniband HDR",3.5,"CentOS 7.6.1810",26,156,NVMe,"352.0 GB",NVMe,"Infiniband HDR",3.5,"CentOS 7.6.1810",,,81.060000,85.540000,25.640000,56.160000,789.960000,4155.240000,921.600000,112.610000,489.300000,32.500000,35.050000,6846.000000,,6846.000000,,,2019-11-12-WekaIOWekaIOWekaIOMatrix-10-261.zip,,11/12/19,,,https://github.com/IO500/submission-data/tree/master/WekaIO/WekaIO/WekaIO/2019/submission-30,,,,0,,,,0,,,,0,,,,0,,0,,,,,,,,,,,,,,,,,,,,,,,,,,,,,,,,,,0,,,0,,,,,,,,,,,,,,,,,,,,,,,,,,156.50999450684
20,ISC21,Cygnus,"University of Tsukuba",OSS,CHFS,10,240,148.689189,30.385217,727.606276,,,,isc21,,"Osamu Tatebe",6/7/21,,,,CHFS,,24,CentOS,7.9,3.1,,,,,,,,,68,,,,,,,,,,71.693064,71.836846,12.144590,13.628314,1582.615900,1955.423375,656.241600,258.633235,841.245150,602.414994,279.392210,,,1056.268758,,,2021.05.24-00.05.20.zip,1,,,,https://github.com/IO500/submission-data/tree/master/University%20of%20Tsukuba/Cygnus/CHFS/2021/submission-541,,,,0,,,,0,,,,0,,,,0,,0,,,,,,,,,,,,,,,,,,,,,,,,,,,,,,,,,,0,,,0,,,,,,,,,,,,,,,,,,,,,,,,,,148.68899536133
21,ISC21,Govorun,"Joint Institute of Nuclear Research",RSC,DAOS,10,160,132.064713,20.193628,863.692659,,,,isc21,,,6/10/21,,2021-04,,RSC,1.2,16,,,,,,,,,,,,8,,,,,,,,,,37.714715,16.746869,19.741594,13.336159,1102.720950,2016.176058,741.151972,343.169370,629.058439,983.473306,714.156350,,,1239.415980,,,2021.06.07-21.09.20.zip,1,,,,,,,,0,,,,0,,,,0,,,,0,,0,,,,,,,,,,,,,,,,,,,,,,,,,,,,,,,,,,0,,,0,,,,,,,,,,,,,,,,,,,,,,,,,,132.06500244141
22,SC20,Frontera,TACC,DDN,IME,10,280,109.910000,176.230000,68.550000,158.170000,zip,1,sc20,2020-11-19,"DDN IME",10/30/20,,2019-03-22,,IME,1.4.1,28,CentOS,7.7,3.1,2,468,SSD,192GB,Infiniband,IB-HDR,"Lustre 2.10.7","CentOS 7.6",32,22,NVMe-SSD,128GB,Infiniband,IB-HDR,1.4.1,"CentOS 7.7",,,189.660000,187.260000,190.050000,142.900000,34.650000,259.210000,24.090000,6.540000,174.360000,144.320000,20.570000,665.000000,,665.000000,,,2020-10-30-TACCIMEIME-10-28.zip,1,10/30/20,,,https://github.com/IO500/submission-data/tree/master/TACC/Frontera/IME/2020/submission-462,,,,0,,,,0,,,,0,,,,0,,0,,,,,,,,,,,,,,,,,,,,,,,,,,,,,,,,,,0,,,0,,,,,,,,,,,,,,,,,,,,,,,,,,109.91000366211
23,ISC21,"Earth Simulator","Japan Agency for Marine-Earth Science and Technology",DDN,Lustre,10,320,101.878409,48.190182,215.380186,,,,isc21,,"Tsuyoshi NAKAGAWA",6/10/21,,,,Data,,32,,,,8,,,,,,,,20,,HDD,,,"Infiniband, 200 GBit, 2x",,,,,254.472680,221.612186,5.125428,18.658181,144.722921,1258.251390,97.618424,41.864914,168.992899,382.984220,18.442281,,,5213.090670,,,2021.05.25-21.17.35.zip,1,,,,https://github.com/IO500/submission-data/tree/master/Japan%20Agency%20for%20Marine-Earth%20Science%20and%20Technology/Earth%20Simulator/Data/2021/submission-548,,,,0,,,,0,,,,0,,,,0,,0,,,,,,,,,,,,,,,,,,,,,,,,,,,,,,,,,,0,,,0,,,,,,,,,,,,,,,,,,,,,,,,,,101.87799835205
24,ISC20,bracewell,CSIRO,Dell/DDN,Lustre,10,400,99.640000,39.900000,248.810000,227.700000,zip,1,isc20,2020-07-14,CSIRO,7/13/20,,2018-08-08,,scratch2,2.12.3,40,CentOS,7.7,3.10,8,4,NVMe,192,NVMe,IB-EDR,2.12.3,7.7,8,20,NVMe,192,NVMe,IB-EDR,2.12.3,7.7,,,135.030000,133.620000,10.440000,13.460000,206.330000,485.450000,186.400000,150.710000,208.810000,378.140000,124.150000,532.000000,,532.000000,,,2020.07.14-13.32.08-scr.zip,1,7/13/20,,https://www.vi4io.org/hpsl/2020/aus/CSIRO/start,https://github.com/IO500/submission-data/tree/master/CSIRO/bracewell/scratch2/2020/submission-47,,,,0,,,,0,,,,0,,,,0,,0,,,,,,,,,,,,,,,,,,,,,,,,,,,,,,,,,,0,,,0,,,,,,,,,,,,,,,,,,,,,,,,,,99.639999389648
25,SC19,TStor3000,"State Key Laboratory of High-end Server & Storage Technology (HSS)",INSPUR,BeeGFS,10,300,82.570000,41.140000,165.710000,175.430000,zip,1,sc19,2019-11-14,,11/7/19,,2019-10-10,2019-11-01,beegfs,7.1.3,30,Linux,CentOS7.6,3.10.0-957.el7.x86_64,24,3,AEP,384GB,AEP,EDR,7.1.3,CentOS7.6,24,192,NVME,384GB,NVME,EDR,7.1.3,CentOS7.6,,,105.100000,97.260000,6.430000,43.560000,478.030000,2621.060000,762.010000,8.470000,26.920000,121.680000,11.870000,1810.000000,,1810.000000,,,2019-11-07-StateKeyLaboratoryofHigh-endServerStorageTechnologyHSSbeegfsBeeGFS-10-30.zip,1,11/7/19,,,https://github.com/IO500/submission-data/tree/master/State%20Key%20Laboratory%20of%20High-end%20Server%20%26%20Storage%20Technology%20%28HSS%29/TStor3000/beegfs/2019/submission-58,,,,0,,,,0,,,,0,,,,0,,0,,,,,,,,,,,,,,,,,,,,,,,,,,,,,,,,,,0,,,0,,,,,,,,,,,,,,,,,,,,,,,,,,82.569999694824
26,SC19,iFLYTEK,iFLYTEK,Yanrong,YRCloudFile,10,200,78.540000,13.550000,455.180000,237.640000,zip,1,sc19,2019-11-10,Yanrong,11/1/19,,09/2019,10/2019,YRCloudFile,6.0,20,CentOS,7.4,4.12.14,20,1,NVMe,128GB,NVMe,"IB EDR",,7.4,10,2,NVMe,128GB,NVMe,"IB EDR",,7.4,,,33.180000,10.960000,6.190000,14.990000,268.010000,1084.310000,199.000000,179.910000,241.760000,909.830000,258.900000,3110.000000,,3110.000000,,,2019-11-01-iFLYTEKYRCloudFileYRCloudFile-10-20.zip,,11/1/19,,,https://github.com/IO500/submission-data/tree/master/iFLYTEK/iFLYTEK/YRCloudFile/2019/submission-59,,,,0,,,,0,,,,0,,,,0,,0,,,,,,,,,,,,,,,,,,,,,,,,,,,,,,,,,,0,,,0,,,,,,,,,,,,,,,,,,,,,,,,,,78.540000915527
27,ISC20,AI400X,DDN,DDN,Lustre,10,160,69.920000,21.010000,232.700000,175.830000,zip,1,isc20,2020-07-13,"Shuichi Ihara",7/13/20,,2020-06-30,2020-06-30,Exascaler,2.13.53,16,CentOS,8.1,4.18.0-147.8.1.el8_1.x86_64,0,0,0,0,0,0,0,0,2,10,NVMe,3.84TB,NVMe,IB-EDR,2.13.53,CentOS7.7,,,37.560000,45.950000,2.770000,40.810000,157.220000,453.510000,135.090000,90.470000,169.000000,446.750000,76.940000,1698.000000,,1698.000000,,,2020.07.13-07.46.20-scr.zip,1,7/13/20,,,https://github.com/IO500/submission-data/tree/master/DDN/AI400X/Exascaler/2020/submission-66,,,,0,,,,0,,,,0,,,,0,,0,,,,,,,,,,,,,,,,,,,,,,,,,,,,,,,,,,0,,,0,,,,,,,,,,,,,,,,,,,,,,,,,,69.919998168945
28,SC21,"Arches 2021B","IBM Tucson",IBM,SpectrumScale,10,200,68.825996,33.019051,143.463171,0.000000,,1,sc21,8.02400441613064E+017,"Jay Vaddi",10/28/21,,,,"IBM Elastic Storage System 3200 - 2 Building Blocks","IBM ESS 6.1.1 + IBM Spectrum Scale 5.1.2",20,RedHat,8.1,4.18.0-147.el8.x86_64,0,0,,,,,,,4,0,SSD,,NVMe,Infiniband,,,,,106.350048,88.066995,4.338218,29.254735,195.624633,272.152271,113.436856,22.303113,205.366311,266.883487,20.507810,1185.217512,,1185.217512,-,-,2021.10.25-09.53.20.zip,,11/19/21,,,https://github.com/IO500/submission-data/tree/master/IBM%20Tucson/Arches%202021B/IBM%20Elastic%20Storage%20System%203200%20-%202%20Building%20Blocks/2021/submission-590,,,,0,,,,0,,,,0,,,,0,,0,,,,,,,,,,,,,,,,,,,,,,,,,,,,,,,,,,0,,,0,,,,,,,,,,,,,,,,,,,,,,,,,,68.825996398926
29,SC19,bracewell,CSIRO,Dell/ThinkParQ,beegfs,10,160,66.800000,33.770000,132.150000,141.250000,zip,1,sc19,2019-11-3,"CSIRO IM&T",11/8/19,,2018-10-02,2019-09-04,scratch2,7.1.3,16,SLES,"SLES 12 SP4",4.12,2,24,NVMe,384GB,NVMe,"IB EDR",7.1.3,"SLES 12 SP4",9,24,NVMe,192GB,NVMe,"IB EDR",7.1.3,"SLES 12 SP4",,,111.550000,92.990000,2.110000,59.470000,152.160000,921.710000,230.530000,11.030000,38.050000,130.820000,18.780000,2790.000000,,2790.000000,,,2019-11-08-CSIROscratch2beegfs-10-16.zip,,11/8/19,,,https://github.com/IO500/submission-data/tree/master/CSIRO/bracewell/scratch2/2019/submission-69,,,,0,,,,0,,,,0,,,,0,,0,,,,,,,,,,,,,,,,,,,,,,,,,,,,,,,,,,0,,,0,,,,,,,,,,,,,,,,,,,,,,,,,,66.800003051758
30,SC19,AI400,DDN,DDN,Lustre,10,240,63.880000,19.650000,207.630000,159.380000,zip,1,sc19,2019-11-7,"Shuichi Ihara",11/10/19,,,,AI400,2.12.58,24,CentOS,8.0,4.18.0-80.el8.x86_64,2,0,SSD,64GB,NVMe,Infiniband,2.12.58,CentOS7.6,2,12,SSD,64GB,NVMe,Infiniband,2.12.58,CentOS7.6,,,28.620000,41.720000,2.960000,42.190000,152.840000,451.970000,132.760000,79.650000,172.590000,449.930000,75.150000,810.000000,,810.000000,,,2019-11-10-DDNAI400Lustre-10-24.zip,1,11/10/19,,,https://github.com/IO500/submission-data/tree/master/DDN/AI400/AI400/2019/submission-75,,,,0,,,,0,,,,0,,,,0,,0,,,,,,,,,,,,,,,,,,,,,,,,,,,,,,,,,,0,,,0,,,,,,,,,,,,,,,,,,,,,,,,,,63.880001068115