id,release_id,information_system,information_institution,information_storage_vendor,information_filesystem_type,information_client_nodes,information_client_total_procs,io500_score,io500_bw,io500_md,io500_tot_iops,information_data,information_10_node_challenge,information_list_name,information_identifier,information_submitter,information_submission_date,information_embargo_end_date,information_storage_install_date,information_storage_refresh_date,information_filesystem_name,information_filesystem_version,information_client_procs_per_node,information_client_operating_system,information_client_operating_system_version,information_client_kernel_version,information_md_nodes,information_md_storage_devices,information_md_storage_type,information_md_volatile_memory_capacity,information_md_storage_interface,information_md_network,information_md_software_version,information_md_operating_system_version,information_ds_nodes,information_ds_storage_devices,information_ds_storage_type,information_ds_volatile_memory_capacity,information_ds_storage_interface,information_ds_network,information_ds_software_version,information_ds_operating_system_version,information_note,information_best,ior_easy_write,ior_easy_read,ior_hard_write,ior_hard_read,mdtest_easy_write,mdtest_easy_stat,mdtest_easy_delete,mdtest_hard_write,mdtest_hard_read,mdtest_hard_stat,mdtest_hard_delete,find_easy,find_hard,find_mixed,marker_score,marker_md,storage_data,include_in_io500,valid_from,valid_to,cdcl_url,repository_url,user_id,result_tar,result_tar_dir,result_tar_size,result_tar_type,job_script,job_script_dir,job_script_size,job_script_type,job_output,job_output_dir,job_output_size,job_output_type,system_information,system_information_dir,system_information_size,system_information_type,information_client_sockets,information_ds_clock,information_ds_media_secondary_count,information_ds_media_primary_vendor,information_ds_model,information_ds_media_secondary_capacity,information_md_spdk,information_md_media_secondary_vendor,information_ds_kernel_version,status_old,information_client_interconnect_vendor,information_ds_interconnect_rdma,information_ds_media_secondary_vendor,status_id,information_client_dpdk,information_md_interconnect_links,information_md_dpdk,information_ds_architecture,information_md_interconnect_vendor,information_ds_interconnect_links,information_client_interconnect_type,information_ds_cores_per_socket,information_md_media_primary_count,information_md_media_secondary_count,information_client_spdk,information_md_media_secondary_capacity,information_md_kernel_version,information_ds_interconnect_type,information_ds_interconnect_vendor,information_md_architecture,information_ds_sockets,information_md_interconnect_rdma,information_client_model,information_md_media_secondary_interface,information_client_interconnect_links,information_ds_operating_system,information_ds_spdk,information_client_cores_per_socket,information_md_interconnect_bandwidth,information_client_volatile_memory_capacity,information_client_clock,information_ds_media_secondary_interface,information_md_clock,information_ds_media_primary_count,information_client_architecture,information_client_interconnect_rdma,information_md_media_primary_type,information_md_model,information_ds_interconnect_bandwidth,information_md_operating_system,information_ds_dpdk,information_client_interconnect_bandwidth,information_ds_media_primary_interface,information_md_cores_per_socket,information_ds_media_primary_capacity,information_md_media_secondary_type,information_ds_media_secondary_type,information_md_media_primary_vendor,information_md_media_primary_interface,information_md_media_primary_capacity,information_md_interconnect_type,information_ds_media_primary_type,information_md_sockets,score
1,ISC21,"Pengcheng Cloudbrain-II on Atlas 900","Pengcheng Laboratory",Pengcheng,MadFS,512,36864,36850.368550,3421.624277,396872.816100,,,,isc21,,"Pengcheng Laboratory and Tsinghua University",6/9/21,,2020-10,,Pengcheng,1,72,KylinOS,v10sp1,4.19.148,,,,,,,,,512,,,,,"Ethernet, 100 GBit, 2x",,,,,3360.298674,2803.716632,3716.573255,3914.484508,278101.309400,529803.484400,287724.351200,102419.383000,209906.918700,410069.944300,183148.570400,,,8991786.331000,,,NULL,1,,,,,,,,0,,,,0,,,,0,,,,0,,0,,,,,,,,,,,,,,,,,,,,,,,,,,,,,,,,,,0,,,0,,,,,,,,,,,,,,,,,,,,,,,,,,36850.3984375
2,SC22,SuperStore,"Tsinghua Storage Research Group","Tsinghua Storage Research Group",SuperFS,10,1200,5517.730969,179.601715,169515.948800,0.000000,,1,-,148801004491339372,"Xiaojian Liao",10/29/22,,,,SuperFS,2,120,Ubuntu,"18.04.6 LTS","4.15.0-194-generic x86_64",0,0,,,,,,,5,8,SSD,"153.6 TiB",NVMe,Infiniband,,,,,153.608621,227.046639,145.346286,205.261410,246528.223600,175630.148700,250876.291600,31799.914830,35995.610660,180970.753600,274649.469900,,,1103307.368000,-,-,-,1,10/29/22,,,,,,,0,,,,0,,,,0,,,,0,,0,,,,,,,,,,,,,,,,,,,,,,,,,,,,,,,,,,0,,,0,,,,,,,,,,,,,,,,,,,,,,,,,,5517.7309570312
3,SC22,ParaStor,"Sugon Cloud Storage Laboratory",Sugon,ParaStor,10,2560,8726.418450,718.108965,106042.930300,0.000000,,1,-,341047689757374060,"Matt Zhang",10/31/22,,01/11/2021,,ParaStor,3.2.0,256,CentOS,7.9,3.10.0-1160.36.3.el7,0,0,,,,,,,80,12,SSD,"3 PiB",NVMe,Infiniband,,,,,905.493155,776.421213,561.636174,673.478535,16986.037220,400423.546900,544798.591300,1013.157241,2347.598629,267891.276100,502738.813800,,,13471142.170000,-,-,-,1,10/31/22,,,,,,,0,,,,0,,,,0,,,,0,,0,,,,,,,,,,,,,,,,,,,,,,,,,,,,,,,,,,0,,,0,,,,,,,,,,,,,,,,,,,,,,,,,,8726.41796875
4,SC22,StarStor,"SuPro Storteck","SuPro Storteck",StarStor,10,2560,6751.748168,515.145792,88491.654330,0.000000,,1,-,434756776542352073,"Lv Lei",10/28/22,,01/12/2021,,StarStor,1.0.0,256,CentOS,7.9,3.10.0-1160.36.3.el7,0,0,,,,,,,80,10,SSD,"3 PiB",NVMe,Infiniband,,,,,502.876053,770.074734,325.667932,558.408215,6394.667581,403598.836300,548638.606600,1062.154627,2268.791710,211762.578600,506217.008900,,,10280067.080000,-,-,-,1,10/28/22,,,,,,,0,,,,0,,,,0,,,,0,,0,,,,,,,,,,,,,,,,,,,,,,,,,,,,,,,,,,0,,,0,,,,,,,,,,,,,,,,,,,,,,,,,,6751.748046875
5,SC22,"Aurora Storage","Argonne National Laboratory",Intel,DAOS,260,27040,20694.496120,6048.686604,70802.506020,0.000000,,,-,28733116785785276,"Kevin Harms",11/1/22,,,,DAOS,2.4tb1,104,"SUSE Enterprise",15SP3,5.3.18-59.37-default,0,0,,,,,,,250,16,PMEM,"64 PB",NVDIMM,,,,,,8121.216166,7902.422629,4795.290353,4349.587799,145696.813800,101911.220800,113779.205400,53017.993980,63803.314020,80885.419300,88201.041190,,,15489.721170,-,-,-,1,11/1/22,,,,,,,0,,,,0,,,,0,,,,0,,0,,,,,,,,,,,,,,,,,,,,,,,,,,,,,,,,,,0,,,0,,,,,,,,,,,,,,,,,,,,,,,,,,20694.49609375
6,ISC22,Shanhe,"National Supercomputing Center in Jinan",PDSL,flashfs,10,2560,3534.419035,207.788114,60119.501960,,,1,,,jeanlucabez@gmail.com,5/9/22,,,,FlashFS2,2.0,,CentOS,7,3.10,,,,,,,,,,,,,,,,,,,202.291539,272.828683,146.428084,230.669769,23561.671586,76181.162991,28737.290364,10798.572003,48907.874720,81699.975582,30481.603612,,,2515466.993163,,,,1,,,,,e8d646eb-fb55-45c8-b3e6-0cdd84c8a28d,io500.tgz,webroot/files/submissions/4cd38883e4d00cbcbb9baf1092f1f406e91ad18e/,531543,application/x-compressed-tar,job.sh,webroot/files/submissions/4cd38883e4d00cbcbb9baf1092f1f406e91ad18e/,4703,application/x-shellscript,,,0,,site.json,webroot/files/submissions/91bc105c7ec845a63ca99bea092b3d32cdfd5db5/,10538,application/json,0,,,,,,,,,,,,,,,,,,,,,,,,,,,,,,,,,,0,,,0,,,,,,,,,,,,,,,,,,,,,,,,,,3534.419921875
7,SC21,,"Huawei Cloud",PDSL,Flashfs,15,1560,2016.697583,109.819859,37034.004400,0.000000,,,sc21,8.49437544233335E+017,PDSL,10/29/21,,,,Flashfs,1,104,EulerOS,"2.0 (SP9)",4.18,0,0,,,,,,,15,0,,,,,,,,,117.327938,115.220985,102.020160,105.464064,23660.761640,35048.861590,27992.117040,17215.620490,11299.343080,34554.069230,29510.926850,768438.443400,,768438.443400,-,-,2021.10.29-21.39.44.zip,1,11/19/21,,,,,,,0,,,,0,,,,0,,,,0,,0,,,,,,,,,,,,,,,,,,,,,,,,,,,,,,,,,,0,,,0,,,,,,,,,,,,,,,,,,,,,,,,,,2016.6999511719
8,SC22,HPC-OCI,"Cloudam HPC on OCI",Cloudam,BurstFS,64,1920,3033.026289,278.482099,33033.536090,0.000000,,,-,292674353979979734,,10/31/22,,,,"Cloudam BurstFS",,30,ol,7.9,5.4.17-2136.310.7.el7uek.x86_64,0,0,,,,,,,64,1,SSD,"243 TiB",NVMe,,,,,,220.415144,420.633749,251.540359,257.890838,33741.683170,34289.563920,28956.026680,10131.706870,10593.638720,33929.430880,22785.037710,,,510057.043900,-,-,-,1,10/31/22,,,,,,,0,,,,0,,,,0,,,,0,,0,,,,,,,,,,,,,,,,,,,,,,,,,,,,,,,,,,0,,,0,,,,,,,,,,,,,,,,,,,,,,,,,,3033.0263671875
9,SC21,Athena,"Huawei HPDA Lab",Huawei,OceanFS,10,1720,2395.027851,314.556370,18235.708940,0.000000,,1,sc21,4.3839474780424E+016,"Phost Feng",11/2/21,,2021-06-16,,"OceanStor Pacific",8.1.1,172,CentOS,7.6.1810,3.10.0-957,0,0,,,,,,,80,800,SSD,,NVMe,Ethernet,,,,,301.767026,351.516185,274.387848,336.365894,4638.639800,125444.196700,4704.730688,3732.752487,1214.262346,125645.190200,4724.230643,1660299.894000,,1660299.894000,-,-,2021.11.01-15.13.47.zip,1,11/19/21,,,https://github.com/IO500/submission-data/tree/master/Huawei%20HPDA%20Lab/Athena/OceanStor%20Pacific/2021/submission-579,,,,0,,,,0,,,,0,,,,0,,0,,,,,,,,,,,,,,,,,,,,,,,,,,,,,,,,,,0,,,0,,,,,,,,,,,,,,,,,,,,,,,,,,2395.0300292969
10,SC21,"OceanStor Pacific","Olympus Lab",Huawei,OceanFS,10,1720,2298.691341,317.072880,16664.881200,0.000000,,1,sc21,8.93667011109576E+017,"Phost Feng",10/29/21,,2021-04-30,,"OceanStor Pacific",8.1.1,172,CentOS,7.6.1810,3.10.0-957,0,0,,,,,,,40,400,SSD,,NVMe,Ethernet,,,,,300.506711,357.784942,282.139748,333.193012,4766.548729,125682.525500,4771.774125,2723.771711,1068.374898,126232.865400,4803.187258,1179404.068000,,1179404.068000,-,-,2021.10.29-17.15.21.zip,1,11/19/21,,,https://github.com/IO500/submission-data/tree/master/Olympus%20Lab/OceanStor%20Pacific/OceanStor%20Pacific/2021/submission-592,,,,0,,,,0,,,,0,,,,0,,0,,,,,,,,,,,,,,,,,,,,,,,,,,,,,,,,,,0,,,0,,,,,,,,,,,,,,,,,,,,,,,,,,2298.6899414062
11,SC21,Kongming,"BPFS Lab",,BPFS,10,800,972.603929,96.260247,9827.093046,0.000000,,1,sc21,7.04806058185321E+017,,10/31/21,,,,BPFS,,80,CentOS,7.5,4.14,0,0,,,,,,,35,280,SSD,,NVMe,Ethernet,,,,,91.347802,75.765181,106.138701,116.881653,7050.545698,11081.175060,7893.367693,3485.201281,4086.084567,10336.178180,8042.844092,119131.006300,,119131.006300,-,-,2021.10.31-19.21.04.zip,1,11/19/21,,,https://github.com/IO500/submission-data/tree/master/BPFS%20Lab/Kongming/BPFS/2021/submission-588,,,,0,,,,0,,,,0,,,,0,,0,,,,,,,,,,,,,,,,,,,,,,,,,,,,,,,,,,0,,,0,,,,,,,,,,,,,,,,,,,,,,,,,,972.60400390625
12,ISC21,Endeavour,Intel,Intel,DAOS,10,1440,1859.556390,398.765034,8671.647896,,,,isc21,,"Mohamad Chaarawi",6/9/21,,2020-09,,DAOS,1.3.101,144,CentOS,,4.18.0-240.22.1.el8_3.crt2.x86_64,,12,,,,,,,40,8,PMEM,,NVDIMM,"Infiniband, 200 GBit",,7,,,538.829306,586.050057,389.251396,205.708472,13347.628000,12962.256060,7556.862360,6278.339486,10042.811820,12320.820540,5489.515231,,,5734.732097,,,2021.05.31-18.01.25.zip,1,,,,https://github.com/IO500/submission-data/tree/master/Intel/Endeavour/DAOS/2021/submission-554,,,,0,,,,0,,,,0,,,,0,,0,,,,,,,,,,,,,,,,,,,,,,,,,,,,,,,,,,0,,,0,,,,,,,,,,,,,,,,,,,,,,,,,,1859.5600585938
13,ISC20,Wolf,Intel,Intel,DAOS,52,1664,1792.980000,371.670000,8649.570000,5103.140000,zip,,isc20,2020-07-23,Intel,7/13/20,,,,DAOS,1.1,32,CentOS,7.7,3.10.0-1062.12.1.el7.x86_64,0,0,,,,,,,30,60,"Optane Persistent Memory",512GB,DDR-T,Omnipath,1.1,7.7,,,243.640000,575.590000,261.220000,520.920000,12326.300000,11928.800000,6897.990000,5646.530000,8620.140000,10723.200000,6695.910000,8838.000000,,8838.000000,,,2020.06.28-19.21.15-scr.zip,1,7/13/20,,,https://github.com/IO500/submission-data/tree/master/Intel/Wolf/DAOS/2020/submission-1,,,,0,,,,0,,,,0,,,,0,,0,,,,,,,,,,,,,,,,,,,,,,,,,,,,,,,,,,0,,,0,,,,,,,,,,,,,,,,,,,,,,,,,,1792.9799804688
14,ISC20,Frontera,TACC,Intel,DAOS,60,1440,763.800000,78.310000,7449.560000,2748.860000,zip,,isc20,2020-07-29,Intel,7/13/20,,,,DAOS,1.1,24,CentOS,7.8,3.10.0-1127.13.1.el7.x86_64,0,0,,,,,,,16,24,"Optane Persistent Memory",256GB,DDR-T,Infiniband,1.1,7.8,,,90.840000,75.750000,76.330000,71.620000,11306.000000,11124.800000,6542.630000,5015.780000,7406.070000,9156.060000,5949.250000,5696.000000,,5696.000000,,,2020.07.12-20.45.38-scr.zip,1,7/13/20,,,https://github.com/IO500/submission-data/tree/master/TACC/Frontera/DAOS/2020/submission-5,,,,0,,,,0,,,,0,,,,0,,0,,,,,,,,,,,,,,,,,,,,,,,,,,,,,,,,,,0,,,0,,,,,,,,,,,,,,,,,,,,,,,,,,763.79998779297
15,ISC22,"SuperMUC-NG Phase2",LRZ,Lenovo,DAOS,20,1280,1371.295669,321.752860,5844.398129,,,,,,jeanlucabez@gmail.com,5/12/22,,,,"DAOS on Lenovo SR630v2 ",2.0.2-2,,"SUSE Enterprise",15.3,5.3.18-57-default,,,,,,,,,,,,,,,,,,,502.682357,622.699940,211.238256,162.085671,11507.900423,12559.996455,3819.713293,3289.384745,7705.524764,9232.451364,2912.295378,,,3617.700603,,,,1,,,,,e8d646eb-fb55-45c8-b3e6-0cdd84c8a28d,io500.tgz,webroot/files/submissions/f548069e2c4beb88a9cd7ec7b0d65bcd779f8daf/,257228,application/x-compressed-tar,,,0,,,,0,,site.json,webroot/files/submissions/706a1453d6a9c4ce6b75da80ba46aedda73d3848/,10618,application/json,0,,,,,,,,,,,,,,,,,,,,,,,,,,,,,,,,,,0,,,0,,,,,,,,,,,,,,,,,,,,,,,,,,1371.3000488281
16,ISC21,Lenovo-Lenox,Lenovo,Lenovo,DAOS,36,3456,988.989572,176.373760,5545.611607,,,,isc21,,,6/11/21,,2020-04,,Lenovo,1.3.101-2,96,CentOS,7.7.1908,3.10.0-1062.18.1.el7.x86_64,,12,,,,,,,12,8,PMEM,,NVDIMM,"Infiniband, 100 GBit, 2x",,7.9.2009,,,169.812184,195.352199,147.996627,197.104677,6968.232917,11212.083410,3869.981600,2114.924660,5775.439193,8835.444564,3918.497644,,,6996.000113,,,2021.06.11-18.55.05.zip,1,,,,https://github.com/IO500/submission-data/tree/master/Lenovo/Lenovo-Lenox/Lenovo/2021/submission-546,,,,0,,,,0,,,,0,,,,0,,0,,,,,,,,,,,,,,,,,,,,,,,,,,,,,,,,,,0,,,0,,,,,,,,,,,,,,,,,,,,,,,,,,988.98999023438
17,SC19,"WekaIO on AWS",WekaIO,WekaIO,"WekaIO Matrix",345,8625,938.950000,174.740000,5045.330000,2770.210000,zip,,sc19,2019-11-41,"Alexander Howard",11/11/19,,2019-11-08,,WekaIO,3.5,25,"Amazon Linux","AMI release 2017.09",4.9.51-10.52.amzn1.x86_64,120,8,NVMe,"768.0 GiB",NVMe,Ethernet,3.5,"Amazon Linux AMI release 2017.09",120,960,NVMe,"768.0 GiB",NVMe,Ethernet,3.5,"Amazon Linux AMI release 2017.09",,,298.130000,325.620000,71.570000,134.200000,2235.660000,36673.300000,3385.190000,438.860000,7709.030000,28649.100000,476.120000,32781.000000,,32781.000000,,,2019-11-11-WekaIOWekaIOWekaIOMatrix-345-25,1,11/11/19,,,https://github.com/IO500/submission-data/tree/master/WekaIO/WekaIO%20on%20AWS/WekaIO/2019/submission-3,,,,0,,,,0,,,,0,,,,0,,0,,,,,,,,,,,,,,,,,,,,,,,,,,,,,,,,,,0,,,0,,,,,,,,,,,,,,,,,,,,,,,,,,938.95001220703
18,SC22,Meadowgate,"Meadowgate Technologies","INTEL HPE",DAOS,10,1280,1014.235035,213.146828,4826.122510,0.000000,,1,-,692677582632686632,"Drew Lehner",8/24/22,,2022,,DAOS,2.0.3,128,rhel,8.4,4.18.0-305.el8.x86_64,0,0,,,,,,,10,80,Flash,"300 TiB",NVMe,,,,,,262.809792,394.933088,134.690357,147.643364,7286.711118,9255.516905,2717.967910,2340.856676,5854.251362,7453.933407,2231.812369,,,7042.401868,-,-,-,1,8/24/22,,,,,,,0,,,,0,,,,0,,,,0,,0,,,,,,,,,,,,,,,,,,,,,,,,,,,,,,,,,,0,,,0,,,,,,,,,,,,,,,,,,,,,,,,,,1014.2350463867
19,ISC22,Cumulus,"University of Cambridge",Dell/Intel,DAOS,200,2000,1107.174140,283.189223,4328.676643,,,,,,jeanlucabez@gmail.com,5/19/22,,,,DAC2-DAOS,"DAOS 2.0.2",,RedHat,8,,,,,,,,,,,,,,,,,,,,350.190839,441.837728,153.315455,271.114892,6953.459189,8358.854734,2311.551904,1907.187617,5162.589298,6606.467789,2059.136103,,,6849.745730,,,,1,,,,,e8d646eb-fb55-45c8-b3e6-0cdd84c8a28d,io500.tgz,webroot/files/submissions/8438156c814af3304b0d0747bc8ce0c3bcfd2253/,358780,application/x-compressed-tar,job.sh,webroot/files/submissions/8438156c814af3304b0d0747bc8ce0c3bcfd2253/,4169,application/x-shellscript,,,0,,site.json,webroot/files/submissions/08acd457851dafa329127f3efd9f41a1ce24d1e1/,10335,application/json,0,,,,,,,,,,,,,,,,,,,,,,,,,,,,,,,,,,0,,,0,,,,,,,,,,,,,,,,,,,,,,,,,,1107.1700439453
20,ISC21,Venus2,"National Supercomputer Center in GuangZhou","National Supercomputer Center in GuangZhou",kapok,18,720,577.929537,104.521769,3195.530983,,,,isc21,,"NSCC-GZ FS team",6/11/21,,2021-04-28,,Venus2,1.2,40,CentOS,7.6.1810,3.10.0-957.el7.x86_64,,,,,,,,,38,,,,,"Ethernet, 100 GBit",,,,,96.804951,139.654380,97.208284,90.817928,1774.466137,7157.602221,2905.245390,841.565238,2770.609799,7358.679332,2334.027490,,,7357.955680,,,2021.06.10-20.58.30.zip,1,,,,https://github.com/IO500/submission-data/tree/master/National%20Supercomputer%20Center%20in%20GuangZhou/Venus2/Venus2/2021/submission-552,,,,0,,,,0,,,,0,,,,0,,0,,,,,,,,,,,,,,,,,,,,,,,,,,,,,,,,,,0,,,0,,,,,,,,,,,,,,,,,,,,,,,,,,577.92999267578
21,SC21,ASTRA,"National Research Center of Tranlational Medicine at Shanghai Ruijin Hospital",NRCTM,DAOS,10,360,511.021541,87.496411,2984.614027,0.000000,,1,sc21,4.98513563854882E+017,"LU Gang",10/29/21,,2021-08-01,,mustang,2.1.100,36,CentOS,7.9,3.10.0-1160.36.2.el7.x86_64,0,0,,,,,,,25,300,PMEM,,NVDIMM,,,,,,97.884571,102.354627,71.710894,81.574438,4896.241935,5041.119244,2179.374241,1754.731265,3456.875758,4392.239470,1561.463428,2813.659509,,2813.659509,-,-,2021.10.23-10.42.55.zip,1,11/19/21,,,https://github.com/IO500/submission-data/tree/master/National%20Research%20Center%20of%20Tranlational%20Medicine%20at%20Shanghai%20Ruijin%20Hospital/ASTRA/mustang/2021/submission-584,,,,0,,,,0,,,,0,,,,0,,0,,,,,,,,,,,,,,,,,,,,,,,,,,,,,,,,,,0,,,0,,,,,,,,,,,,,,,,,,,,,,,,,,511.02200317383
22,ISC22,Lenovo-Lenox3,Lenovo,Lenovo,DAOS,20,1440,624.587560,145.119327,2688.198933,,,,,,jeanlucabez@gmail.com,5/12/22,,,,"DAOS on Lenovo SR630v2 ",2.0.2-2,,CentOS,8.4.2105,4.18.0-305.25.1.el8_4.x86_64,,,,,,,,,,,,,,,,,,,148.108205,225.569757,97.443062,136.235443,4373.889760,4910.287373,1444.268155,1282.356374,2989.263357,3699.173274,1390.957385,,,4457.355202,,,,1,,,,,e8d646eb-fb55-45c8-b3e6-0cdd84c8a28d,io500.tgz,webroot/files/submissions/ac0550b3f77f0cf3097e106ba9f54dfb229774ec/,279765,application/x-compressed-tar,,,0,,,,0,,site.json,webroot/files/submissions/706a1453d6a9c4ce6b75da80ba46aedda73d3848/,9526,application/json,0,,,,,,,,,,,,,,,,,,,,,,,,,,,,,,,,,,0,,,0,,,,,,,,,,,,,,,,,,,,,,,,,,624.58801269531
23,ISC20,Presque,"Argonne National Laboratory","Argonne National Laboratory",DAOS,16,544,537.310000,108.190000,2668.570000,1544.190000,zip,,isc20,2020-07-10,"Argonne National Laboratory",7/13/20,,2019-11-15,2019-11-15,DAOS,1.1,34,RHEL,7.7,3.10.0-1062.4.3.el7.x86_64,10,12,"Intel Apache Pass 128GB DIMM",384,DIMM,100gE,1.1,7.7,10,12,NVMe-SSD,384,NVMe,100gE,1.1,7.7,,,114.580000,130.230000,112.270000,81.770000,4386.200000,4521.230000,2559.270000,924.090000,2100.110000,3730.500000,2357.160000,2969.000000,,2969.000000,,,2020.07.09-19.56.01-scr.zip,1,7/13/20,,,https://github.com/IO500/submission-data/tree/master/Argonne%20National%20Laboratory/Presque/DAOS/2020/submission-10,,,,0,,,,0,,,,0,,,,0,,0,,,,,,,,,,,,,,,,,,,,,,,,,,,,,,,,,,0,,,0,,,,,,,,,,,,,,,,,,,,,,,,,,537.30999755859
24,SC21,"QCT DevCloud","QCT DevCloud",QCT,DAOS,10,560,427.274472,102.854524,1774.967866,0.000000,,1,sc21,2.81298341357477E+017,,11/1/21,,,,QCT,1.3.106,56,CentOS,8.3,4.18.0-240,0,0,,,,,,,4,64,PMEM,512,NVDIMM,Infiniband,,,,,119.560689,178.243087,50.510865,103.969915,2606.603625,4368.152777,965.623009,821.912330,2590.701460,3196.019286,1023.352966,1286.666016,,1286.666016,-,-,2021.10.31-23.07.20.zip,1,11/19/21,,,https://github.com/IO500/submission-data/tree/master/QCT%20DevCloud/QCT%20DevCloud/QCT/2021/submission-581,,,,0,,,,0,,,,0,,,,0,,0,,,,,,,,,,,,,,,,,,,,,,,,,,,,,,,,,,0,,,0,,,,,,,,,,,,,,,,,,,,,,,,,,427.27398681641
25,ISC22,"Oracle Cloud with WEKA on RDMA","Oracle Cloud Infrastructure",WekaIO,WEKA,373,7460,625.947019,233.167729,1680.376924,,,,,,jeanlucabez@gmail.com,5/13/22,,,,"WEKA on OCI",3.14.0,,ol,7.9,3.10.0-1160.25.1.el7.x86_64,,,,,,,,,,,,,,,,,,,522.078490,1583.685022,15.806725,226.165976,1695.946362,14143.482732,2589.975637,586.244052,2434.403857,2275.677865,763.400263,,,412.719841,,,,1,,,,,e8d646eb-fb55-45c8-b3e6-0cdd84c8a28d,io500.tgz,webroot/files/submissions/fccabbddae1f22d914a4e75d5b51a48929c78fdf/,1483317,application/x-compressed-tar,job.sh,webroot/files/submissions/fccabbddae1f22d914a4e75d5b51a48929c78fdf/,11272,application/x-shellscript,,,0,,site.json,webroot/files/submissions/645561d3b27d52c3336c2de29c5d12d1e41daf50/,8831,application/json,0,,,,,,,,,,,,,,,,,,,,,,,,,,,,,,,,,,0,,,0,,,,,,,,,,,,,,,,,,,,,,,,,,625.94702148438
26,ISC21,,Supermicro,Supermicro,DAOS,10,1120,415.039693,112.174143,1535.629705,,,,isc21,,,6/11/21,,,,SYS-120U-TNR,1.13.101,112,,,,,,,,,,,,4,,,,,,,,,,113.491924,163.248695,88.264742,96.820899,3785.499014,4405.937075,1720.793799,1000.790372,131.407871,2281.987628,1476.884379,,,2430.958209,,,2021.06.11-04.35.19.zip,1,,,,,,,,0,,,,0,,,,0,,,,0,,0,,,,,,,,,,,,,,,,,,,,,,,,,,,,,,,,,,0,,,0,,,,,,,,,,,,,,,,,,,,,,,,,,415.04000854492
27,SC22,CTPAI,"China Telecom Research Institute",CTCLOUD,DAOS,10,250,212.289220,31.401326,1435.185041,0.000000,,1,-,854615959256720764,"Song Ke",11/12/22,,,,TeleHPCS,"v 2.2.0",25,CentOS,7.9,3.10.0-1160.el7.x86_64,0,0,,,,,,,10,0,PMEM,"33 TB",NVDIMM,Ethernet,,,,,37.687284,30.188378,30.442336,28.072387,2297.622080,2168.890750,1001.612951,635.335184,1619.825213,1994.296350,1122.490679,,,1565.321284,-,-,-,1,11/12/22,,,,,,,0,,,,0,,,,0,,,,0,,0,,,,,,,,,,,,,,,,,,,,,,,,,,,,,,,,,,0,,,0,,,,,,,,,,,,,,,,,,,,,,,,,,212.28921508789
28,SC20,NextGENIO,EPCC,"BSC & JGU",GekkoFS,10,3800,239.370000,45.790000,1251.320000,699.780000,zip,1,sc20,2020-11-23,"Ramon Nou",10/30/20,,2019-01-01,2020-10-10,GekkoFS,0.9dev,380,CentOS,,3.10.0-862.14.4.el7.x86_64,31,2,3DXPNVMeSSDv,2,NVMe,Omnipath,0.8dev,,31,2,3DXPNVMeSSD,2,NVMe,Omnipath,0.9dev,,,,73.660000,76.410000,26.840000,29.100000,1709.390000,1926.370000,1844.140000,288.530000,583.340000,1721.460000,691.370000,4942.000000,,4942.000000,,,2020-10-30-EPCCGekkoFSGekkoFS-10-380.zip,1,10/30/20,,,https://github.com/IO500/submission-data/tree/master/EPCC/NextGENIO/GekkoFS/2020/submission-455,,,,0,,,,0,,,,0,,,,0,,0,,,,,,,,,,,,,,,,,,,,,,,,,,,,,,,,,,0,,,0,,,,,,,,,,,,,,,,,,,,,,,,,,239.36999511719
29,SC20,"MOGON II","Johannes Gutenberg University Mainz","JGU (ADA-FS)& BSC (NEXTGenIO)",GekkoFS,10,240,167.640000,22.970000,1223.590000,547.750000,zip,1,sc20,2020-11-3,"Marc-AndrÃ© Vef",10/30/20,,2017-10-01,,GekkoFS,0.9dev,24,CentOS,,3.10.0-1127.8.2.el7.x86_64,224,1,"Intel SSD DC S4600 Series",,SATA,Omnipath,0.9dev,,224,1,"Intel SSD DC S4600 Series",,SATA,Omnipath,0.9dev,,,,42.320000,26.900000,17.540000,13.940000,2019.870000,1970.750000,2082.080000,426.960000,419.000000,2030.350000,377.660000,4419.000000,,4419.000000,,,2020-10-30-JohannesGutenbergUniversityMainzGekkoFSGekkoFS-10-24.zip,1,10/30/20,,,https://github.com/IO500/submission-data/tree/master/Johannes%20Gutenberg%20University%20Mainz/MOGON%20II/GekkoFS/2020/submission-457,,,,0,,,,0,,,,0,,,,0,,0,,,,,,,,,,,,,,,,,,,,,,,,,,,,,,,,,,0,,,0,,,,,,,,,,,,,,,,,,,,,,,,,,167.63999938965
30,ISC21,Google,"Google Cloud",DDN,Lustre,1000,5000,569.988364,282.780461,1148.900933,,,,isc21,,,6/11/21,,,,DDN-GCP-LocalSSD,,5,,,4.18.0-305.3.1.el8.x86_64,50,,SSD,,NVMe,,,,200,,SSD,,NVMe,,,,,,699.800593,1273.164627,38.783632,185.050489,1925.249725,1900.699024,904.443383,809.177119,1498.197803,1840.684722,495.688865,,,829.234818,,,2021.06.10-19.46.24.zip,1,,,,https://github.com/IO500/submission-data/tree/master/Google%20Cloud/Google/DDN-GCP-LocalSSD/2021/submission-542,,,,0,,,,0,,,,0,,,,0,,0,,,,,,,,,,,,,,,,,,,,,,,,,,,,,,,,,,0,,,0,,,,,,,,,,,,,,,,,,,,,,,,,,569.98797607422